{"text_format":"1","workbook":"xlsx","n_sheets":5,"sheets":["TBL"," cal simul 22-23 (2)"," cal simul 22-23","Légende","BD_CAL"],"not_rendered":{"charts":0,"images":1,"macros":1,"external_links":0,"defined_names":13,"comments":0,"pivot_tables":0},"unopened":[],"bounds":{"document_bytes":16777216,"sheet_cells":100000,"rows_first":2000,"rows_last":500,"rows_between":2000,"halvings":0,"cell_chars":16384,"cell_head_chars":4096},"cells_cut":0,"cells_raw":0,"read":"whole","date_system":"1900"}

{"sheet":"TBL","index":0,"n_rows":35,"n_cols":2,"rows_kept":35,"cut":false,"hidden":true,"merged":[[3,4,3,5],[3,6,3,7],[3,8,3,9]]}
[]
[null,"Fériés"]
["Janvier",{"$f":"DATE(An-1,1,1)","v":{"$error":"#REF!"}}]
["Février",{"$f":"ROUND(DATE(An-1,4,MOD(234-11*MOD(An-1,19),30))/7,0)*7-6+1","v":{"$error":"#REF!"}}]
["Mars",{"$f":"DATE(An-1,5,1)","v":{"$error":"#REF!"}}]
["Avril",{"$f":"DATE(An-1,5,8)","v":{"$error":"#REF!"}}]
["Mai",{"$f":"B4+38","v":{"$error":"#REF!"}}]
["Juin",{"$f":"B4+49","v":{"$error":"#REF!"}}]
["Juillet",{"$f":"DATE(An-1,7,14)","v":{"$error":"#REF!"}}]
["Août",{"$f":"DATE(An-1,8,15)","v":{"$error":"#REF!"}}]
["Septembre",{"$f":"DATE(An-1,11,1)","v":{"$error":"#REF!"}}]
["Octobre",{"$f":"DATE(An-1,11,11)","v":{"$error":"#REF!"}}]
["Novembre",{"$f":"DATE(An-1,12,25)","v":{"$error":"#REF!"}}]
["Décembre",{"$f":"DATE(An,1,1)","v":{"$error":"#REF!"}}]
[null,{"$f":"ROUND(DATE(An,4,MOD(234-11*MOD(An,19),30))/7,0)*7-6+1","v":{"$error":"#REF!"}}]
[null,{"$f":"DATE(An,5,1)","v":{"$error":"#REF!"}}]
[null,{"$f":"DATE(An,5,8)","v":{"$error":"#REF!"}}]
[null,{"$f":"B15+38","v":{"$error":"#REF!"}}]
[null,{"$f":"B15+49","v":{"$error":"#REF!"}}]
[null,{"$f":"DATE(An,7,14)","v":{"$error":"#REF!"}}]
[null,{"$f":"DATE(An,8,15)","v":{"$error":"#REF!"}}]
[null,{"$f":"DATE(An,11,1)","v":{"$error":"#REF!"}}]
[null,{"$f":"DATE(An,11,11)","v":{"$error":"#REF!"}}]
[null,{"$f":"DATE(An,12,25)","v":{"$error":"#REF!"}}]
[null,{"$f":"DATE(An+1,1,1)","v":{"$error":"#REF!"}}]
[null,{"$f":"ROUND(DATE(An+1,4,MOD(234-11*MOD(An+1,19),30))/7,0)*7-6+1","v":{"$error":"#REF!"}}]
[null,{"$f":"DATE(An+1,5,1)","v":{"$error":"#REF!"}}]
[null,{"$f":"DATE(An+1,5,8)","v":{"$error":"#REF!"}}]
[null,{"$f":"B26+38","v":{"$error":"#REF!"}}]
[null,{"$f":"B26+49","v":{"$error":"#REF!"}}]
[null,{"$f":"DATE(An+1,7,14)","v":{"$error":"#REF!"}}]
[null,{"$f":"DATE(An+1,8,15)","v":{"$error":"#REF!"}}]
[null,{"$f":"DATE(An+1,11,1)","v":{"$error":"#REF!"}}]
[null,{"$f":"DATE(An+1,11,11)","v":{"$error":"#REF!"}}]
[null,{"$f":"DATE(An+1,12,25)","v":{"$error":"#REF!"}}]

{"sheet":" cal simul 22-23 (2)","index":1,"n_rows":45,"n_cols":58,"rows_kept":45,"cut":false,"hidden":false,"merged":[[0,16,3,35],[4,2,4,5],[4,40,4,49],[4,50,4,53],[5,2,5,5],[5,6,5,9],[5,10,5,13],[5,14,5,17],[5,18,5,21],[5,22,5,25],[5,50,5,53],[14,55,15,55],[11,57,13,61],[5,26,5,29],[5,30,5,33],[5,34,5,37],[5,38,5,41],[5,42,5,45],[5,46,5,49]]}
[null,null,null,null,null,null,null,null,null,null,null,null,null,null,null,null,"Planning de l'alernance 2024/2025\nMention : ECONOMIE GESTION\nParcours : ECONOMIE GESTION\nNombre d'heures total : 463 h",null,null,null,null,null,null,null,null,null,null,null,null,null,null,null,null,null,null,null,null,null,null,null,"Date ou période de soutenance"]
[null,null,null,null,null,null,null,null,null,null,null,null,null,null,null,null,null,null,null,null,null,null,null,null,null,null,null,null,null,null,null,null,null,null,null,null,null,null,null,null,"Date de début et de fin du cycle de formation"]
[null,null,null,null,null,null,null,null,null,null,null,null,null,null,null,null,null,null,null,null,null,null,null,null,null,null,null,null,null,null,null,null,null,null,null,null,null,null,null,null,"Periodes en entreprise"]
[null,null,null,null,null,null,null,null,null,null,null,null,null,null,null,null,null,null,null,null,null,null,null,null,null,null,null,null,null,null,null,null,null,null,null,null,null,null,null,null,"Périodes à l'université"]
[null,null,2024,null,null,null,{"$f":"IF(MONTH(1&G6)=1,An+1,\"\")","v":""},null,null,null,null,null,null,null,null,null,null,null,null,null,null,null,null,null,null,null,null,null,null,null,null,null,null,null,null,null,null,null,null,null,"Vacances universitaires",null,null,null,null,null,null,null,null,null,2025]
[null,null,"septembre",null,null,null,{"$f":"CHOOSE(IF(MONTH(1&C6)=12,1,MONTH(1&C6)+1),\"Janvier\",\"Février\",\"Mars\",\"Avril\",\"Mai\",\"Juin\",\"Juillet\",\"Août\",\"Septembre\",\"Octobre\",\"Novembre\",\"Décembre\")","v":"Octobre"},null,null,null,{"$f":"CHOOSE(IF(MONTH(1&G6)=12,1,MONTH(1&G6)+1),\"Janvier\",\"Février\",\"Mars\",\"Avril\",\"Mai\",\"Juin\",\"Juillet\",\"Août\",\"Septembre\",\"Octobre\",\"Novembre\",\"Décembre\")","v":"Novembre"},null,null,null,{"$f":"CHOOSE(IF(MONTH(1&K6)=12,1,MONTH(1&K6)+1),\"Janvier\",\"Février\",\"Mars\",\"Avril\",\"Mai\",\"Juin\",\"Juillet\",\"Août\",\"Septembre\",\"Octobre\",\"Novembre\",\"Décembre\")","v":"Décembre"},null,null,null,{"$f":"CHOOSE(IF(MONTH(1&O6)=12,1,MONTH(1&O6)+1),\"Janvier\",\"Février\",\"Mars\",\"Avril\",\"Mai\",\"Juin\",\"Juillet\",\"Août\",\"Septembre\",\"Octobre\",\"Novembre\",\"Décembre\")","v":"Janvier"},null,null,null,{"$f":"CHOOSE(IF(MONTH(1&S6)=12,1,MONTH(1&S6)+1),\"Janvier\",\"Février\",\"Mars\",\"Avril\",\"Mai\",\"Juin\",\"Juillet\",\"Août\",\"Septembre\",\"Octobre\",\"Novembre\",\"Décembre\")","v":"Février"},null,null,null,{"$f":"CHOOSE(IF(MONTH(1&W6)=12,1,MONTH(1&W6)+1),\"Janvier\",\"Février\",\"Mars\",\"Avril\",\"Mai\",\"Juin\",\"Juillet\",\"Août\",\"Septembre\",\"Octobre\",\"Novembre\",\"Décembre\")","v":"Mars"},null,null,null,{"$f":"CHOOSE(IF(MONTH(1&AA6)=12,1,MONTH(1&AA6)+1),\"Janvier\",\"Février\",\"Mars\",\"Avril\",\"Mai\",\"Juin\",\"Juillet\",\"Août\",\"Septembre\",\"Octobre\",\"Novembre\",\"Décembre\")","v":"Avril"},null,null,null,{"$f":"CHOOSE(IF(MONTH(1&AE6)=12,1,MONTH(1&AE6)+1),\"Janvier\",\"Février\",\"Mars\",\"Avril\",\"Mai\",\"Juin\",\"Juillet\",\"Août\",\"Septembre\",\"Octobre\",\"Novembre\",\"Décembre\")","v":"Mai"},null,null,null,{"$f":"CHOOSE(IF(MONTH(1&AI6)=12,1,MONTH(1&AI6)+1),\"Janvier\",\"Février\",\"Mars\",\"Avril\",\"Mai\",\"Juin\",\"Juillet\",\"Août\",\"Septembre\",\"Octobre\",\"Novembre\",\"Décembre\")","v":"Juin"},null,null,null,{"$f":"CHOOSE(IF(MONTH(1&AM6)=12,1,MONTH(1&AM6)+1),\"Janvier\",\"Février\",\"Mars\",\"Avril\",\"Mai\",\"Juin\",\"Juillet\",\"Août\",\"Septembre\",\"Octobre\",\"Novembre\",\"Décembre\")","v":"Juillet"},null,null,null,{"$f":"CHOOSE(IF(MONTH(1&AQ6)=12,1,MONTH(1&AQ6)+1),\"Janvier\",\"Février\",\"Mars\",\"Avril\",\"Mai\",\"Juin\",\"Juillet\",\"Août\",\"Septembre\",\"Octobre\",\"Novembre\",\"Décembre\")","v":"Août"},null,null,null,{"$f":"CHOOSE(IF(MONTH(1&AU6)=12,1,MONTH(1&AU6)+1),\"Janvier\",\"Février\",\"Mars\",\"Avril\",\"Mai\",\"Juin\",\"Juillet\",\"Août\",\"Septembre\",\"Octobre\",\"Novembre\",\"Décembre\")","v":"Septembre"}]
[null,null,{"$f":"couleur","v":15},{"$f":"DATE(An,MONTH(1&C$6),1)","v":"2024-09-01"},{"$f":"IF(WEEKDAY(D7,2)=3, _xlfn.ISOWEEKNUM(D7),\"\")","v":""},null,{"$f":"couleur","v":6},{"$f":"DATE(IF(MONTH(1&G$6)=1,An+1,An),MONTH(1&G$6),1)","v":"2024-10-01"},{"$f":"IF(WEEKDAY(H7,2)=3, _xlfn.ISOWEEKNUM(H7),\"\")","v":""},null,{"$f":"couleur","v":44},{"$f":"DATE(IF(MONTH(1&G$6)<MONTH(1&K$6),YEAR(H7),An+1),MONTH(1&K$6),1)","v":"2024-11-01"},null,null,{"$f":"couleur","v":2},{"$f":"DATE(IF(MONTH(1&K$6)<MONTH(1&O$6),YEAR(L7),An+1),MONTH(1&O$6),1)","v":"2024-12-01"},{"$f":"IF(WEEKDAY(P7,2)=3, _xlfn.ISOWEEKNUM(P7),\"\")","v":""},null,{"$f":"couleur","v":44},{"$f":"DATE(IF(MONTH(1&O$6)<MONTH(1&S$6),YEAR(P7),An+1),MONTH(1&S$6),1)","v":"2025-01-01"},{"$f":"IF(WEEKDAY(T7,2)=3, _xlfn.ISOWEEKNUM(T7),\"\")","v":1},null,{"$f":"couleur","v":2},{"$f":"DATE(IF(MONTH(1&S$6)<MONTH(1&W$6),YEAR(T7),An+1),MONTH(1&W$6),1)","v":"2025-02-01"},{"$f":"IF(WEEKDAY(X7,2)=3, _xlfn.ISOWEEKNUM(X7),\"\")","v":""},null,{"$f":"couleur","v":6},{"$f":"DATE(IF(MONTH(1&W$6)<MONTH(1&AA$6),YEAR(X7),An+1),MONTH(1&AA$6),1)","v":"2025-03-01"},{"$f":"IF(WEEKDAY(AB7,2)=3, _xlfn.ISOWEEKNUM(AB7),\"\")","v":""},null,{"$f":"couleur","v":6},{"$f":"DATE(IF(MONTH(1&AA$6)<MONTH(1&AE$6),YEAR(AB7),An+1),MONTH(1&AE$6),1)","v":"2025-04-01"},{"$f":"IF(WEEKDAY(AF7,2)=3, _xlfn.ISOWEEKNUM(AF7),\"\")","v":""},null,{"$f":"couleur","v":44},{"$f":"DATE(IF(MONTH(1&AE$6)<MONTH(1&AI$6),YEAR(AF7),An+1),MONTH(1&AI$6),1)","v":"2025-05-01"},{"$f":"IF(WEEKDAY(AJ7,2)=3, _xlfn.ISOWEEKNUM(AJ7),\"\")","v":""},null,{"$f":"couleur","v":6},{"$f":"DATE(IF(MONTH(1&AI$6)<MONTH(1&AM$6),YEAR(AJ7),An+1),MONTH(1&AM$6),1)","v":"2025-06-01"},{"$f":"IF(WEEKDAY(AN7,2)=3, _xlfn.ISOWEEKNUM(AN7),\"\")","v":""},null,{"$f":"couleur","v":6},{"$f":"DATE(IF(MONTH(1&AM$6)<MONTH(1&AQ$6),YEAR(AN7),An+1),MONTH(1&AQ$6),1)","v":"2025-07-01"},{"$f":"IF(WEEKDAY(AR7,2)=3, _xlfn.ISOWEEKNUM(AR7),\"\")","v":""},null,{"$f":"couleur","v":6},{"$f":"DATE(IF(MONTH(1&AQ$6)<MONTH(1&AU$6),YEAR(AR7),An+1),MONTH(1&AU$6),1)","v":"2025-08-01"},{"$f":"IF(WEEKDAY(AV7,2)=3, _xlfn.ISOWEEKNUM(AV7),\"\")","v":""},null,{"$f":"couleur","v":15},{"$f":"DATE(IF(MONTH(1&AU$6)<MONTH(1&AY$6),YEAR(AV7),YEAR(AV7)+1),MONTH(1&AY$6),1)","v":"2025-09-01"},{"$f":"IF(WEEKDAY(AZ7,2)=3, _xlfn.ISOWEEKNUM(AZ7),\"\")","v":""}]
[null,null,{"$f":"couleur","v":6},{"$f":"D7+1","v":"2024-09-02"},{"$f":"IF(WEEKDAY(D8,2)=3, _xlfn.ISOWEEKNUM(D8),\"\")","v":""},null,{"$f":"couleur","v":33},{"$f":"H7+1","v":"2024-10-02"},{"$f":"IF(WEEKDAY(H8,2)=3, _xlfn.ISOWEEKNUM(H8),\"\")","v":40},null,{"$f":"couleur","v":6},{"$f":"L7+1","v":"2024-11-02"},{"$f":"IF(WEEKDAY(L8,2)=3, _xlfn.ISOWEEKNUM(L8),\"\")","v":""},null,{"$f":"couleur","v":6},{"$f":"P7+1","v":"2024-12-02"},{"$f":"IF(WEEKDAY(P8,2)=3, _xlfn.ISOWEEKNUM(P8),\"\")","v":""},null,{"$f":"couleur","v":6},{"$f":"T7+1","v":"2025-01-02"},{"$f":"IF(WEEKDAY(T8,2)=3, _xlfn.ISOWEEKNUM(T8),\"\")","v":""},null,{"$f":"couleur","v":2},{"$f":"X7+1","v":"2025-02-02"},{"$f":"IF(WEEKDAY(X8,2)=3, _xlfn.ISOWEEKNUM(X8),\"\")","v":""},null,{"$f":"couleur","v":33},{"$f":"AB7+1","v":"2025-03-02"},{"$f":"IF(WEEKDAY(AB8,2)=3, _xlfn.ISOWEEKNUM(AB8),\"\")","v":""},null,{"$f":"couleur","v":33},{"$f":"AF7+1","v":"2025-04-02"},{"$f":"IF(WEEKDAY(AF8,2)=3, _xlfn.ISOWEEKNUM(AF8),\"\")","v":14},null,{"$f":"couleur","v":6},{"$f":"AJ7+1","v":"2025-05-02"},{"$f":"IF(WEEKDAY(AJ8,2)=3, _xlfn.ISOWEEKNUM(AJ8),\"\")","v":""},null,{"$f":"couleur","v":6},{"$f":"AN7+1","v":"2025-06-02"},{"$f":"IF(WEEKDAY(AN8,2)=3, _xlfn.ISOWEEKNUM(AN8),\"\")","v":""},null,{"$f":"couleur","v":6},{"$f":"AR7+1","v":"2025-07-02"},{"$f":"IF(WEEKDAY(AR8,2)=3, _xlfn.ISOWEEKNUM(AR8),\"\")","v":27},null,{"$f":"couleur","v":2},{"$f":"AV7+1","v":"2025-08-02"},{"$f":"IF(WEEKDAY(AV8,2)=3, _xlfn.ISOWEEKNUM(AV8),\"\")","v":""},null,{"$f":"couleur","v":15},{"$f":"AZ7+1","v":"2025-09-02"},{"$f":"IF(WEEKDAY(AZ8,2)=3, _xlfn.ISOWEEKNUM(AZ8),\"\")","v":""}]
[null,null,{"$f":"couleur","v":6},{"$f":"D8+1","v":"2024-09-03"},"",null,{"$f":"couleur","v":33},{"$f":"H8+1","v":"2024-10-03"},"",null,{"$f":"couleur","v":6},{"$f":"L8+1","v":"2024-11-03"},"",null,{"$f":"couleur","v":6},{"$f":"P8+1","v":"2024-12-03"},"",null,{"$f":"couleur","v":6},{"$f":"T8+1","v":"2025-01-03"},"",null,{"$f":"couleur","v":6},{"$f":"X8+1","v":"2025-02-03"},"",null,{"$f":"couleur","v":6},{"$f":"AB8+1","v":"2025-03-03"},"",null,{"$f":"couleur","v":33},{"$f":"AF8+1","v":"2025-04-03"},"",null,{"$f":"couleur","v":2},{"$f":"AJ8+1","v":"2025-05-03"},"",null,{"$f":"couleur","v":6},{"$f":"AN8+1","v":"2025-06-03"},"",null,{"$f":"couleur","v":6},{"$f":"AR8+1","v":"2025-07-03"},"",null,{"$f":"couleur","v":2},{"$f":"AV8+1","v":"2025-08-03"},"",null,{"$f":"couleur","v":15},{"$f":"AZ8+1","v":"2025-09-03"},36]
[null,null,{"$f":"couleur","v":6},"2024-09-04",36,null,{"$f":"couleur","v":6},"2024-10-04","",null,{"$f":"couleur","v":6},"2024-11-04","",null,{"$f":"couleur","v":33},"2024-12-04",49,null,{"$f":"couleur","v":6},"2025-01-04","",null,{"$f":"couleur","v":6},"2025-02-04","",null,{"$f":"couleur","v":6},"2025-03-04","",null,{"$f":"couleur","v":33},"2025-04-04","",null,{"$f":"couleur","v":2},"2025-05-04","",null,{"$f":"couleur","v":6},"2025-06-04",23,null,{"$f":"couleur","v":6},"2025-07-04","",null,{"$f":"couleur","v":6},"2025-08-04","",null,{"$f":"couleur","v":15},"2025-09-04",""]
[null,null,{"$f":"couleur","v":6},"2024-09-05",{"$f":"IF(WEEKDAY(D11,2)=3, _xlfn.ISOWEEKNUM(D11),\"\")","v":""},null,{"$f":"couleur","v":2},"2024-10-05","",null,{"$f":"couleur","v":6},"2024-11-05","",null,{"$f":"couleur","v":33},"2024-12-05","",null,{"$f":"couleur","v":6},"2025-01-05","",null,{"$f":"couleur","v":33},"2025-02-05",6,null,{"$f":"couleur","v":33},"2025-03-05",10,null,{"$f":"couleur","v":2},"2025-04-05","",null,{"$f":"couleur","v":6},"2025-05-05","",null,{"$f":"couleur","v":6},"2025-06-05","",null,{"$f":"couleur","v":2},"2025-07-05","",null,{"$f":"couleur","v":6},"2025-08-05","",null,{"$f":"couleur","v":15},"2025-09-05",""]
[null,null,{"$f":"couleur","v":33},{"$f":"D11+1","v":"2024-09-06"},"",null,{"$f":"couleur","v":2},"2024-10-06","",null,{"$f":"couleur","v":33},"2024-11-06",45,null,{"$f":"couleur","v":33},"2024-12-06","",null,{"$f":"couleur","v":6},"2025-01-06","",null,{"$f":"couleur","v":33},"2025-02-06","",null,{"$f":"couleur","v":33},"2025-03-06","",null,{"$f":"couleur","v":2},"2025-04-06","",null,{"$f":"couleur","v":6},"2025-05-06","",null,{"$f":"couleur","v":33},"2025-06-06","",null,{"$f":"couleur","v":2},"2025-07-06","",null,{"$f":"couleur","v":6},"2025-08-06",32,null,{"$f":"couleur","v":2},"2025-09-06","",null,null,"Nb d'heures total de formation",463,"9 jours d'examens en complément\nsont prévus, où les étudiants reviendront en entreprise"]
[null,null,{"$f":"couleur","v":15},"2024-09-07","",null,{"$f":"couleur","v":6},"2024-10-07","",null,{"$f":"couleur","v":33},"2024-11-07","",null,{"$f":"couleur","v":2},"2024-12-07","",null,{"$f":"couleur","v":6},"2025-01-07","",null,{"$f":"couleur","v":33},"2025-02-07","",null,{"$f":"couleur","v":33},"2025-03-07","",null,{"$f":"couleur","v":6},"2025-04-07","",null,{"$f":"couleur","v":6},"2025-05-07",19,null,{"$f":"couleur","v":2},"2025-06-07","",null,{"$f":"couleur","v":6},"2025-07-07","",null,{"$f":"couleur","v":6},"2025-08-07","",null,{"$f":"couleur","v":2},"2025-09-07","",null,null,"Nb de jours en entreprise"]
[null,null,{"$f":"couleur","v":15},"2024-09-08","",null,{"$f":"couleur","v":6},"2024-10-08","",null,{"$f":"couleur","v":33},"2024-11-08","",null,{"$f":"couleur","v":2},"2024-12-08","",null,{"$f":"couleur","v":6},"2025-01-08",2,null,{"$f":"couleur","v":2},"2025-02-08","",null,{"$f":"couleur","v":2},"2025-03-08","",null,{"$f":"couleur","v":6},"2025-04-08","",null,{"$f":"couleur","v":44},"2025-05-08","",null,{"$f":"couleur","v":2},"2025-06-08","",null,{"$f":"couleur","v":6},"2025-07-08","",null,{"$f":"couleur","v":6},"2025-08-08","",null,{"$f":"couleur","v":15},"2025-09-08","",null,null,"Nb de jours à l'université"]
[null,null,{"$f":"couleur","v":6},"2024-09-09","",null,{"$f":"couleur","v":33},"2024-10-09",41,null,{"$f":"couleur","v":2},"2024-11-09","",null,{"$f":"couleur","v":6},"2024-12-09","",null,{"$f":"couleur","v":6},"2025-01-09","",null,{"$f":"couleur","v":2},"2025-02-09","",null,{"$f":"couleur","v":2},"2025-03-09","",null,{"$f":"couleur","v":6},"2025-04-09",15,null,{"$f":"couleur","v":6},"2025-05-09","",null,{"$f":"couleur","v":44},"2025-06-09","",null,{"$f":"couleur","v":6},"2025-07-09",28,null,{"$f":"couleur","v":2},"2025-08-09","",null,{"$f":"couleur","v":15},"2025-09-09","",null,null,"Nb d'heures moyen de formation par jour à l'université","7h"]
[null,null,{"$f":"couleur","v":6},"2024-09-10","",null,{"$f":"couleur","v":33},"2024-10-10","",null,{"$f":"couleur","v":2},"2024-11-10","",null,{"$f":"couleur","v":6},"2024-12-10","",null,{"$f":"couleur","v":6},"2025-01-10","",null,{"$f":"couleur","v":6},"2025-02-10","",null,{"$f":"couleur","v":6},"2025-03-10","",null,{"$f":"couleur","v":6},"2025-04-10","",null,{"$f":"couleur","v":2},"2025-05-10","",null,{"$f":"couleur","v":6},"2025-06-10","",null,{"$f":"couleur","v":6},"2025-07-10","",null,{"$f":"couleur","v":2},"2025-08-10","",null,{"$f":"couleur","v":15},"2025-09-10",37]
[null,null,{"$f":"couleur","v":33},"2024-09-11",37,null,{"$f":"couleur","v":6},"2024-10-11","",null,{"$f":"couleur","v":44},"2024-11-11","",null,{"$f":"couleur","v":33},"2024-12-11",50,null,{"$f":"couleur","v":2},"2025-01-11","",null,{"$f":"couleur","v":6},"2025-02-11","",null,{"$f":"couleur","v":6},"2025-03-11","",null,{"$f":"couleur","v":6},"2025-04-11","",null,{"$f":"couleur","v":2},"2025-05-11","",null,{"$f":"couleur","v":6},"2025-06-11",24,null,{"$f":"couleur","v":6},"2025-07-11","",null,{"$f":"couleur","v":6},"2025-08-11","",null,{"$f":"couleur","v":15},"2025-09-11",""]
[null,null,{"$f":"couleur","v":33},{"$f":"D17+1","v":"2024-09-12"},{"$f":"IF(WEEKDAY(D18,2)=3, _xlfn.ISOWEEKNUM(D18),\"\")","v":""},null,{"$f":"couleur","v":2},"2024-10-12","",null,{"$f":"couleur","v":6},"2024-11-12","",null,{"$f":"couleur","v":33},"2024-12-12","",null,{"$f":"couleur","v":2},"2025-01-12","",null,{"$f":"couleur","v":33},"2025-02-12",7,null,{"$f":"couleur","v":33},"2025-03-12",11,null,{"$f":"couleur","v":2},"2025-04-12","",null,{"$f":"couleur","v":6},"2025-05-12","",null,{"$f":"couleur","v":6},"2025-06-12","",null,{"$f":"couleur","v":2},"2025-07-12","",null,{"$f":"couleur","v":6},"2025-08-12","",null,{"$f":"couleur","v":15},"2025-09-12",""]
[null,null,{"$f":"couleur","v":6},{"$f":"D18+1","v":"2024-09-13"},"",null,{"$f":"couleur","v":2},"2024-10-13","",null,{"$f":"couleur","v":6},"2024-11-13",46,null,{"$f":"couleur","v":33},"2024-12-13","",null,{"$f":"couleur","v":33},"2025-01-13","","examens",{"$f":"couleur","v":33},"2025-02-13","",null,{"$f":"couleur","v":33},"2025-03-13","",null,{"$f":"couleur","v":2},"2025-04-13","",null,{"$f":"couleur","v":6},"2025-05-13","",null,{"$f":"couleur","v":6},"2025-06-13","",null,{"$f":"couleur","v":2},"2025-07-13","",null,{"$f":"couleur","v":6},"2025-08-13",33,null,{"$f":"couleur","v":15},"2025-09-13",""]
[null,null,{"$f":"couleur","v":2},"2024-09-14","",null,{"$f":"couleur","v":6},"2024-10-14","",null,{"$f":"couleur","v":6},"2024-11-14","",null,{"$f":"couleur","v":2},"2024-12-14","",null,{"$f":"couleur","v":33},"2025-01-14","","examens",{"$f":"couleur","v":33},"2025-02-14","",null,{"$f":"couleur","v":33},"2025-03-14","",null,{"$f":"couleur","v":6},"2025-04-14","",null,{"$f":"couleur","v":6},"2025-05-14",20,null,{"$f":"couleur","v":2},"2025-06-14","",null,{"$f":"couleur","v":44},"2025-07-14","",null,{"$f":"couleur","v":6},"2025-08-14","",null,{"$f":"couleur","v":15},"2025-09-14",""]
[null,null,{"$f":"couleur","v":2},"2024-09-15","",null,{"$f":"couleur","v":6},"2024-10-15","",null,{"$f":"couleur","v":6},"2024-11-15","",null,{"$f":"couleur","v":2},"2024-12-15","",null,{"$f":"couleur","v":33},"2025-01-15",3,"examens",{"$f":"couleur","v":2},"2025-02-15","",null,{"$f":"couleur","v":2},"2025-03-15","",null,{"$f":"couleur","v":6},"2025-04-15","",null,{"$f":"couleur","v":6},"2025-05-15","",null,{"$f":"couleur","v":2},"2025-06-15","",null,{"$f":"couleur","v":6},"2025-07-15","",null,{"$f":"couleur","v":6},"2025-08-15","",null,{"$f":"couleur","v":15},"2025-09-15",""]
[null,null,{"$f":"couleur","v":6},"2024-09-16","",null,{"$f":"couleur","v":33},"2024-10-16",42,null,{"$f":"couleur","v":33},"2024-11-16","",null,{"$f":"couleur","v":6},"2024-12-16","",null,{"$f":"couleur","v":33},"2025-01-16","","examens",{"$f":"couleur","v":2},"2025-02-16","",null,{"$f":"couleur","v":2},"2025-03-16","",null,{"$f":"couleur","v":6},"2025-04-16",16,null,{"$f":"couleur","v":6},"2025-05-16","",null,{"$f":"couleur","v":6},"2025-06-16","",null,{"$f":"couleur","v":6},"2025-07-16",29,null,{"$f":"couleur","v":2},"2025-08-16","",null,{"$f":"couleur","v":15},"2025-09-16",""]
[null,null,{"$f":"couleur","v":6},"2024-09-17","",null,{"$f":"couleur","v":33},"2024-10-17","",null,{"$f":"couleur","v":33},"2024-11-17","",null,{"$f":"couleur","v":6},"2024-12-17","",null,{"$f":"couleur","v":33},"2025-01-17","","examens",{"$f":"couleur","v":6},"2025-02-17","",null,{"$f":"couleur","v":6},"2025-03-17","",null,{"$f":"couleur","v":6},"2025-04-17","",null,{"$f":"couleur","v":2},"2025-05-17","",null,{"$f":"couleur","v":6},"2025-06-17","",null,{"$f":"couleur","v":6},"2025-07-17","",null,{"$f":"couleur","v":2},"2025-08-17","",null,{"$f":"couleur","v":15},"2025-09-17",38]
[null,null,{"$f":"couleur","v":33},"2024-09-18",38,null,{"$f":"couleur","v":6},"2024-10-18","",null,{"$f":"couleur","v":6},"2024-11-18","",null,{"$f":"couleur","v":33},"2024-12-18",51,null,{"$f":"couleur","v":2},"2025-01-18","",null,{"$f":"couleur","v":6},"2025-02-18","",null,{"$f":"couleur","v":6},"2025-03-18","",null,{"$f":"couleur","v":6},"2025-04-18","",null,{"$f":"couleur","v":2},"2025-05-18","",null,{"$f":"couleur","v":6},"2025-06-18",25,null,{"$f":"couleur","v":6},"2025-07-18","",null,{"$f":"couleur","v":6},"2025-08-18","",null,{"$f":"couleur","v":15},"2025-09-18",""]
[null,null,{"$f":"couleur","v":33},"2024-09-19","",null,{"$f":"couleur","v":2},"2024-10-19","",null,{"$f":"couleur","v":6},"2024-11-19","",null,{"$f":"couleur","v":33},"2024-12-19","",null,{"$f":"couleur","v":2},"2025-01-19","",null,{"$f":"couleur","v":33},"2025-02-19",8,null,{"$f":"couleur","v":33},"2025-03-19",12,null,{"$f":"couleur","v":2},"2025-04-19","",null,{"$f":"couleur","v":6},"2025-05-19","",null,{"$f":"couleur","v":6},"2025-06-19","",null,{"$f":"couleur","v":2},"2025-07-19","",null,{"$f":"couleur","v":6},"2025-08-19","",null,{"$f":"couleur","v":15},"2025-09-19",""]
[null,null,{"$f":"couleur","v":6},"2024-09-20","",null,{"$f":"couleur","v":2},"2024-10-20","",null,{"$f":"couleur","v":33},"2024-11-20",47,null,{"$f":"couleur","v":33},"2024-12-20","",null,{"$f":"couleur","v":6},"2025-01-20","",null,{"$f":"couleur","v":33},"2025-02-20","",null,{"$f":"couleur","v":33},"2025-03-20","",null,{"$f":"couleur","v":2},"2025-04-20","",null,{"$f":"couleur","v":6},"2025-05-20","",null,{"$f":"couleur","v":6},"2025-06-20","",null,{"$f":"couleur","v":2},"2025-07-20","",null,{"$f":"couleur","v":6},"2025-08-20",34,null,{"$f":"couleur","v":15},"2025-09-20",""]
[null,null,{"$f":"couleur","v":2},"2024-09-21","",null,{"$f":"couleur","v":6},"2024-10-21","",null,{"$f":"couleur","v":33},"2024-11-21","",null,{"$f":"couleur","v":2},{"$f":"P26+1","v":"2024-12-21"},"",null,{"$f":"couleur","v":6},"2025-01-21","",null,{"$f":"couleur","v":33},"2025-02-21","",null,{"$f":"couleur","v":33},"2025-03-21","",null,{"$f":"couleur","v":44},"2025-04-21","",null,{"$f":"couleur","v":6},"2025-05-21",21,null,{"$f":"couleur","v":2},"2025-06-21","",null,{"$f":"couleur","v":6},"2025-07-21","",null,{"$f":"couleur","v":6},"2025-08-21","",null,{"$f":"couleur","v":15},"2025-09-21",""]
[null,null,{"$f":"couleur","v":2},"2024-09-22","",null,{"$f":"couleur","v":6},"2024-10-22","",null,{"$f":"couleur","v":33},"2024-11-22","",null,{"$f":"couleur","v":2},"2024-12-22","",null,{"$f":"couleur","v":33},"2025-01-22",4,null,{"$f":"couleur","v":2},"2025-02-22","",null,{"$f":"couleur","v":2},"2025-03-22","",null,{"$f":"couleur","v":6},"2025-04-22","",null,{"$f":"couleur","v":6},"2025-05-22","",null,{"$f":"couleur","v":2},"2025-06-22","",null,{"$f":"couleur","v":6},"2025-07-22","",null,{"$f":"couleur","v":6},"2025-08-22","",null,{"$f":"couleur","v":15},"2025-09-22",""]
[null,null,{"$f":"couleur","v":6},"2024-09-23","",null,{"$f":"couleur","v":33},"2024-10-23",43,null,{"$f":"couleur","v":2},"2024-11-23","",null,{"$f":"couleur","v":6},"2024-12-23","",null,{"$f":"couleur","v":33},"2025-01-23","",null,{"$f":"couleur","v":2},"2025-02-23","",null,{"$f":"couleur","v":2},"2025-03-23","",null,{"$f":"couleur","v":6},"2025-04-23",17,null,{"$f":"couleur","v":6},"2025-05-23","",null,{"$f":"couleur","v":6},"2025-06-23","",null,{"$f":"couleur","v":6},"2025-07-23",30,null,{"$f":"couleur","v":2},"2025-08-23","",null,{"$f":"couleur","v":15},"2025-09-23",""]
[null,null,{"$f":"couleur","v":6},"2024-09-24","",null,{"$f":"couleur","v":33},"2024-10-24","",null,{"$f":"couleur","v":2},"2024-11-24","",null,{"$f":"couleur","v":6},"2024-12-24","",null,{"$f":"couleur","v":6},"2025-01-24","",null,{"$f":"couleur","v":6},"2025-02-24","",null,{"$f":"couleur","v":6},"2025-03-24","",null,{"$f":"couleur","v":6},"2025-04-24","",null,{"$f":"couleur","v":2},"2025-05-24","",null,{"$f":"couleur","v":6},"2025-06-24","",null,{"$f":"couleur","v":6},"2025-07-24","",null,{"$f":"couleur","v":2},"2025-08-24","",null,{"$f":"couleur","v":15},"2025-09-24",39]
[null,null,{"$f":"couleur","v":33},"2024-09-25",39,null,{"$f":"couleur","v":33},"2024-10-25","",null,{"$f":"couleur","v":6},"2024-11-25","",null,{"$f":"couleur","v":44},"2024-12-25",52,null,{"$f":"couleur","v":2},"2025-01-25","",null,{"$f":"couleur","v":6},"2025-02-25","",null,{"$f":"couleur","v":6},"2025-03-25","",null,{"$f":"couleur","v":6},"2025-04-25","",null,{"$f":"couleur","v":2},"2025-05-25","",null,{"$f":"couleur","v":6},"2025-06-25",26,null,{"$f":"couleur","v":6},"2025-07-25","",null,{"$f":"couleur","v":6},"2025-08-25","",null,{"$f":"couleur","v":15},"2025-09-25",""]
[null,null,{"$f":"couleur","v":33},"2024-09-26","",null,{"$f":"couleur","v":2},"2024-10-26","",null,{"$f":"couleur","v":6},"2024-11-26","",null,{"$f":"couleur","v":6},"2024-12-26","",null,{"$f":"couleur","v":2},"2025-01-26","",null,{"$f":"couleur","v":6},"2025-02-26",9,null,{"$f":"couleur","v":33},"2025-03-26",13,null,{"$f":"couleur","v":6},"2025-04-26","",null,{"$f":"couleur","v":33},"2025-05-26","","examens",{"$f":"couleur","v":6},"2025-06-26","",null,{"$f":"couleur","v":2},"2025-07-26","",null,{"$f":"couleur","v":6},"2025-08-26","",null,{"$f":"couleur","v":15},"2025-09-26",""]
[null,null,{"$f":"couleur","v":6},"2024-09-27","",null,{"$f":"couleur","v":2},"2024-10-27","",null,{"$f":"couleur","v":33},"2024-11-27",48,null,{"$f":"couleur","v":6},"2024-12-27","",null,{"$f":"couleur","v":6},"2025-01-27","",null,{"$f":"couleur","v":6},"2025-02-27","",null,{"$f":"couleur","v":33},"2025-03-27","",null,{"$f":"couleur","v":6},"2025-04-27","",null,{"$f":"couleur","v":33},"2025-05-27","","examens",{"$f":"couleur","v":6},"2025-06-27","",null,{"$f":"couleur","v":2},"2025-07-27","",null,{"$f":"couleur","v":6},"2025-08-27",35,null,{"$f":"couleur","v":15},"2025-09-27",""]
[null,null,{"$f":"couleur","v":2},"2024-09-28","",null,{"$f":"couleur","v":6},"2024-10-28","",null,{"$f":"couleur","v":33},"2024-11-28","",null,{"$f":"couleur","v":6},"2024-12-28","",null,{"$f":"couleur","v":6},"2025-01-28","",null,{"$f":"couleur","v":6},"2025-02-28","",null,{"$f":"couleur","v":33},"2025-03-28","",null,{"$f":"couleur","v":6},"2025-04-28","",null,{"$f":"couleur","v":33},"2025-05-28",22,"examens",{"$f":"couleur","v":2},"2025-06-28","",null,{"$f":"couleur","v":6},"2025-07-28","",null,{"$f":"couleur","v":6},"2025-08-28","",null,{"$f":"couleur","v":15},"2025-09-28",""]
[null,null,{"$f":"couleur","v":2},{"$f":"IFERROR(IF(OR(D34=\"\",MONTH(D34+1)>MONTH(D34)),\"\",D34+1),\"\")","v":"2024-09-29"},{"$f":"IFERROR(IF(WEEKDAY(D35,2)=3, _xlfn.ISOWEEKNUM(D35),\"\"),\"\")","v":""},null,{"$f":"couleur","v":6},{"$f":"IFERROR(IF(OR(H34=\"\",MONTH(H34+1)>MONTH(H34)),\"\",H34+1),\"\")","v":"2024-10-29"},{"$f":"IFERROR(IF(WEEKDAY(H35,2)=3, _xlfn.ISOWEEKNUM(H35),\"\"),\"\")","v":""},null,{"$f":"couleur","v":33},{"$f":"IFERROR(IF(OR(L34=\"\",MONTH(L34+1)>MONTH(L34)),\"\",L34+1),\"\")","v":"2024-11-29"},{"$f":"IFERROR(IF(WEEKDAY(L35,2)=3, _xlfn.ISOWEEKNUM(L35),\"\"),\"\")","v":""},null,{"$f":"couleur","v":6},{"$f":"IFERROR(IF(OR(P34=\"\",MONTH(P34+1)>MONTH(P34)),\"\",P34+1),\"\")","v":"2024-12-29"},{"$f":"IFERROR(IF(WEEKDAY(P35,2)=3, _xlfn.ISOWEEKNUM(P35),\"\"),\"\")","v":""},null,{"$f":"couleur","v":33},{"$f":"IFERROR(IF(OR(T34=\"\",MONTH(T34+1)>MONTH(T34)),\"\",T34+1),\"\")","v":"2025-01-29"},{"$f":"IFERROR(IF(WEEKDAY(T35,2)=3, _xlfn.ISOWEEKNUM(T35),\"\"),\"\")","v":5},null,{"$f":"couleur","v":6},{"$f":"IFERROR(IF(OR(X34=\"\",MONTH(X34+1)>MONTH(X34)),\"\",X34+1),\"\")","v":""},{"$f":"IFERROR(IF(WEEKDAY(X35,2)=3, _xlfn.ISOWEEKNUM(X35),\"\"),\"\")","v":""},{"$f":"IFERROR(IF(OR(Z34=\"\",MONTH(Z34+1)>MONTH(Z34)),\"\",Z34+1),\"\")","v":""},{"$f":"couleur","v":2},{"$f":"IFERROR(IF(OR(AB34=\"\",MONTH(AB34+1)>MONTH(AB34)),\"\",AB34+1),\"\")","v":"2025-03-29"},{"$f":"IFERROR(IF(WEEKDAY(AB35,2)=3, _xlfn.ISOWEEKNUM(AB35),\"\"),\"\")","v":""},null,{"$f":"couleur","v":6},{"$f":"IFERROR(IF(OR(AF34=\"\",MONTH(AF34+1)>MONTH(AF34)),\"\",AF34+1),\"\")","v":"2025-04-29"},{"$f":"IFERROR(IF(WEEKDAY(AF35,2)=3, _xlfn.ISOWEEKNUM(AF35),\"\"),\"\")","v":""},null,{"$f":"couleur","v":44},{"$f":"IFERROR(IF(OR(AJ34=\"\",MONTH(AJ34+1)>MONTH(AJ34)),\"\",AJ34+1),\"\")","v":"2025-05-29"},{"$f":"IFERROR(IF(WEEKDAY(AJ35,2)=3, _xlfn.ISOWEEKNUM(AJ35),\"\"),\"\")","v":""},null,{"$f":"couleur","v":33},{"$f":"IFERROR(IF(OR(AN34=\"\",MONTH(AN34+1)>MONTH(AN34)),\"\",AN34+1),\"\")","v":"2025-06-29"},{"$f":"IFERROR(IF(WEEKDAY(AN35,2)=3, _xlfn.ISOWEEKNUM(AN35),\"\"),\"\")","v":""},null,{"$f":"couleur","v":6},{"$f":"IFERROR(IF(OR(AR34=\"\",MONTH(AR34+1)>MONTH(AR34)),\"\",AR34+1),\"\")","v":"2025-07-29"},{"$f":"IFERROR(IF(WEEKDAY(AR35,2)=3, _xlfn.ISOWEEKNUM(AR35),\"\"),\"\")","v":""},null,{"$f":"couleur","v":6},{"$f":"IFERROR(IF(OR(AV34=\"\",MONTH(AV34+1)>MONTH(AV34)),\"\",AV34+1),\"\")","v":"2025-08-29"},{"$f":"IFERROR(IF(WEEKDAY(AV35,2)=3, _xlfn.ISOWEEKNUM(AV35),\"\"),\"\")","v":""},null,{"$f":"couleur","v":15},{"$f":"IFERROR(IF(OR(AZ34=\"\",MONTH(AZ34+1)>MONTH(AZ34)),\"\",AZ34+1),\"\")","v":"2025-09-29"},{"$f":"IFERROR(IF(WEEKDAY(AZ35,2)=3, _xlfn.ISOWEEKNUM(AZ35),\"\"),\"\")","v":""}]
[null,null,{"$f":"couleur","v":6},{"$f":"IFERROR(IF(OR(D35=\"\",MONTH(D35+1)>MONTH(D35)),\"\",D35+1),\"\")","v":"2024-09-30"},{"$f":"IFERROR(IF(WEEKDAY(D36,2)=3, _xlfn.ISOWEEKNUM(D36),\"\"),\"\")","v":""},null,{"$f":"couleur","v":33},{"$f":"IFERROR(IF(OR(H35=\"\",MONTH(H35+1)>MONTH(H35)),\"\",H35+1),\"\")","v":"2024-10-30"},{"$f":"IFERROR(IF(WEEKDAY(H36,2)=3, _xlfn.ISOWEEKNUM(H36),\"\"),\"\")","v":44},null,{"$f":"couleur","v":2},{"$f":"IFERROR(IF(OR(L35=\"\",MONTH(L35+1)>MONTH(L35)),\"\",L35+1),\"\")","v":"2024-11-30"},{"$f":"IFERROR(IF(WEEKDAY(L36,2)=3, _xlfn.ISOWEEKNUM(L36),\"\"),\"\")","v":""},null,{"$f":"couleur","v":6},{"$f":"IFERROR(IF(OR(P35=\"\",MONTH(P35+1)>MONTH(P35)),\"\",P35+1),\"\")","v":"2024-12-30"},{"$f":"IFERROR(IF(WEEKDAY(P36,2)=3, _xlfn.ISOWEEKNUM(P36),\"\"),\"\")","v":""},null,{"$f":"couleur","v":33},{"$f":"IFERROR(IF(OR(T35=\"\",MONTH(T35+1)>MONTH(T35)),\"\",T35+1),\"\")","v":"2025-01-30"},{"$f":"IFERROR(IF(WEEKDAY(T36,2)=3, _xlfn.ISOWEEKNUM(T36),\"\"),\"\")","v":""},null,{"$f":"couleur","v":0},null,null,null,{"$f":"couleur","v":6},{"$f":"IFERROR(IF(OR(AB35=\"\",MONTH(AB35+1)>MONTH(AB35)),\"\",AB35+1),\"\")","v":"2025-03-30"},{"$f":"IFERROR(IF(WEEKDAY(AB36,2)=3, _xlfn.ISOWEEKNUM(AB36),\"\"),\"\")","v":""},null,{"$f":"couleur","v":6},{"$f":"IFERROR(IF(OR(AF35=\"\",MONTH(AF35+1)>MONTH(AF35)),\"\",AF35+1),\"\")","v":"2025-04-30"},{"$f":"IFERROR(IF(WEEKDAY(AF36,2)=3, _xlfn.ISOWEEKNUM(AF36),\"\"),\"\")","v":18},null,{"$f":"couleur","v":33},{"$f":"IFERROR(IF(OR(AJ35=\"\",MONTH(AJ35+1)>MONTH(AJ35)),\"\",AJ35+1),\"\")","v":"2025-05-30"},{"$f":"IFERROR(IF(WEEKDAY(AJ36,2)=3, _xlfn.ISOWEEKNUM(AJ36),\"\"),\"\")","v":""},"examens",{"$f":"couleur","v":6},{"$f":"IFERROR(IF(OR(AN35=\"\",MONTH(AN35+1)>MONTH(AN35)),\"\",AN35+1),\"\")","v":"2025-06-30"},{"$f":"IFERROR(IF(WEEKDAY(AN36,2)=3, _xlfn.ISOWEEKNUM(AN36),\"\"),\"\")","v":""},null,{"$f":"couleur","v":6},{"$f":"IFERROR(IF(OR(AR35=\"\",MONTH(AR35+1)>MONTH(AR35)),\"\",AR35+1),\"\")","v":"2025-07-30"},{"$f":"IFERROR(IF(WEEKDAY(AR36,2)=3, _xlfn.ISOWEEKNUM(AR36),\"\"),\"\")","v":31},null,{"$f":"couleur","v":2},{"$f":"IFERROR(IF(OR(AV35=\"\",MONTH(AV35+1)>MONTH(AV35)),\"\",AV35+1),\"\")","v":"2025-08-30"},{"$f":"IFERROR(IF(WEEKDAY(AV36,2)=3, _xlfn.ISOWEEKNUM(AV36),\"\"),\"\")","v":""},null,{"$f":"couleur","v":15},{"$f":"IFERROR(IF(OR(AZ35=\"\",MONTH(AZ35+1)>MONTH(AZ35)),\"\",AZ35+1),\"\")","v":"2025-09-30"},{"$f":"IFERROR(IF(WEEKDAY(AZ36,2)=3, _xlfn.ISOWEEKNUM(AZ36),\"\"),\"\")","v":""}]
[null,null,null,null,null,null,{"$f":"couleur","v":6},{"$f":"IFERROR(IF(OR(H36=\"\",MONTH(H36+1)>MONTH(H36)),\"\",H36+1),\"\")","v":"2024-10-31"},{"$f":"IFERROR(IF(WEEKDAY(H37,2)=3, _xlfn.ISOWEEKNUM(H37),\"\"),\"\")","v":""},null,{"$f":"couleur","v":15},{"$f":"IFERROR(IF(OR(L36=\"\",MONTH(L36+1)>MONTH(L36)),\"\",L36+1),\"\")","v":""},{"$f":"IFERROR(IF(WEEKDAY(L37,2)=3, _xlfn.ISOWEEKNUM(L37),\"\"),\"\")","v":""},null,{"$f":"couleur","v":6},{"$f":"IFERROR(IF(OR(P36=\"\",MONTH(P36+1)>MONTH(P36)),\"\",P36+1),\"\")","v":"2024-12-31"},{"$f":"IFERROR(IF(WEEKDAY(P37,2)=3, _xlfn.ISOWEEKNUM(P37),\"\"),\"\")","v":""},null,{"$f":"couleur","v":33},{"$f":"IFERROR(IF(OR(T36=\"\",MONTH(T36+1)>MONTH(T36)),\"\",T36+1),\"\")","v":"2025-01-31"},{"$f":"IFERROR(IF(WEEKDAY(T37,2)=3, _xlfn.ISOWEEKNUM(T37),\"\"),\"\")","v":""},null,{"$f":"couleur","v":0},null,null,null,{"$f":"couleur","v":6},{"$f":"IFERROR(IF(OR(AB36=\"\",MONTH(AB36+1)>MONTH(AB36)),\"\",AB36+1),\"\")","v":"2025-03-31"},{"$f":"IFERROR(IF(WEEKDAY(AB37,2)=3, _xlfn.ISOWEEKNUM(AB37),\"\"),\"\")","v":""},null,{"$f":"couleur","v":0},null,null,null,{"$f":"couleur","v":2},{"$f":"IFERROR(IF(OR(AJ36=\"\",MONTH(AJ36+1)>MONTH(AJ36)),\"\",AJ36+1),\"\")","v":"2025-05-31"},{"$f":"IFERROR(IF(WEEKDAY(AJ37,2)=3, _xlfn.ISOWEEKNUM(AJ37),\"\"),\"\")","v":""},null,{"$f":"couleur","v":0},null,null,null,{"$f":"couleur","v":6},{"$f":"IFERROR(IF(OR(AR36=\"\",MONTH(AR36+1)>MONTH(AR36)),\"\",AR36+1),\"\")","v":"2025-07-31"},{"$f":"IFERROR(IF(WEEKDAY(AR37,2)=3, _xlfn.ISOWEEKNUM(AR37),\"\"),\"\")","v":""},null,{"$f":"couleur","v":6},{"$f":"IFERROR(IF(OR(AV36=\"\",MONTH(AV36+1)>MONTH(AV36)),\"\",AV36+1),\"\")","v":"2025-08-31"},{"$f":"IFERROR(IF(WEEKDAY(AV37,2)=3, _xlfn.ISOWEEKNUM(AV37),\"\"),\"\")","v":""},null,{"$f":"couleur","v":0}]
[null,null,null,null,null,{"$f":"F35+F34+F33+F32+F31+F28+F26+F27+F25+F24+F21+F20+F19+F18+F17+F14+F13+F12+F11+F10+F7+F8+F9+F15+F16+F22+F23+F29+F30+F36","v":0},null,null,null,{"$f":"J37+J36+J33+J31+J32+J30+J29+J26+J25+J24+J23+J22+J19+J18+J17+J16+J15+J12+J11+J10+J9+J8+J35+J34+J27+J28+J21+J20+J14+J13+J7","v":0},null,null,null,{"$f":"SUM(N7:N36)","v":0},null,null,null,{"$f":"SUM(R7:R37)","v":0},null,null,null,{"$f":"SUM(V7:V37)","v":0},null,null,null,{"$f":"SUM(Z7:Z37)","v":0},null,null,null,{"$f":"SUM(AD7:AD37)","v":0},null,null,null,{"$f":"SUM(AH7:AH37)","v":0},null,null,null,{"$f":"SUM(AL7:AL37)","v":0},null,null,null,{"$f":"SUM(AP7:AP37)","v":0},null,null,null,{"$f":"SUM(AT7:AT37)","v":0},null,null,null,{"$f":"SUM(AX7:AX37)","v":0},null,null,null,{"$f":"SUM(BB7:BB36)","v":0},null,{"$f":"BB38+AX38+AT38+AP38+AL38+AH38+AD38+Z38+V38+R38+N38+J38+F38","v":0},"heures"]
[null,null,null,null,null,null,null,null,null,null,null,null,null,null,null,null,null,null,null,null,null,null,null,null,null,null,null,null,null,null,null,null,null,null,null,null,null,null,null,null,null,null,null,null,null,null,null,null,null,null,null,null,null,null,null,{"$f":"BD38/35","v":0},"semaines à 35h"]
[]
[]
[{"$f":"IF(P5=\"Equipe atelier\",A43,IF(P5=\"Equipe 1\",A44,IF(P5=\"Equipe 2\",A45,\"\")))","v":""}]
["Calendrier 2019 Atelier Montage-Assemblage concerne :\nBIGOT YANNICK\nBODY FREDERIC\nBRICARD JEAN-JACQUES\nCHARIF WILFRIED\nCLAIR MELANIE\nCUREAU CORINNE\nDELAGARDE MARIE-ASTRID\nLIVACHE SABRINA\nMARCHAL ROBERT\nMORIN WILLY\nROUQUET SEVERINE\nSOURDEAU PATRICK\nSOYER DOMINIQUE\nTHOMAS JOHAN\nVINCELOT LAURENT\nCADU NATHALIE\nCOUTURIER LAURENT\nFRESNEAU ALAIN\nROCHAIS PHILIPPE\nARRIAL ANGELIQUE\nBELLANGER FRANCK\nBOUVET PASCAL\nHARDOUIN XAVIER\nLECAM EDDY\nMATIGNON DAVID\nMOYNNERAUX CHRISTOPHE\nPORCHER CHRISTOPHE\nSOURDEAU SEBASTIEN"]
["Calendrier 2019 Blanchisserie Equipe 1 concerne :\nAUBIN JACKY\nBARILLER RICHARD\nBEAUMONT PHILIPPE\nBERRUE ARNAUD\nBOUCHENOIRE PHILIPPE\nCHAPEAU PATRICK\nEQUIPE TIPHAINE\nGRIVAULT CHRISTELLE\nIACINO JODIE\nMARCEAU ANNE-SOPHIE\nOSSELIN BENEDICTE\nPETIT EMELINE\nPINIER VIRGINIE\nTAUVRY BRIGITTE\nTOUSSAINT SAMUEL"]
["Calendrier 2019 Blanchisserie Equipe 2 concerne :\nBERTIN LOIC\nBOUFFANDEAU SOPHIE\nCOUE LYSIANE\nDOURNAC NADINE\nDUREAU SONIA\nFRESNEAU BERNARD\nFRESNEAU PASCAL\nGENNETAY LAURENT\nLI CHIANG YAO MARINE\nLUCASSON ELENA\nSALAUN PATRICIA\nTIREL MICKAËL\nVIAL MATHIEU"]

{"sheet":" cal simul 22-23","index":2,"n_rows":45,"n_cols":59,"rows_kept":45,"cut":false,"hidden":false,"merged":[[11,57,11,62],[14,55,15,55],[5,46,5,49],[5,50,5,53],[4,50,4,53],[5,42,5,45],[5,38,5,41],[4,40,4,49],[0,16,3,35],[4,2,4,5],[5,2,5,5],[5,6,5,9],[5,10,5,13],[5,14,5,17],[5,18,5,21],[5,22,5,25],[5,26,5,29],[5,30,5,33],[5,34,5,37]]}
[null,null,null,null,null,null,null,null,null,null,null,null,null,null,null,null,"Planning de l'alernance 2024/2025\nMention : ECONOMIE GESTION\nParcours : ECONOMIE GESTION\nNombre d'heures total : 463 h",null,null,null,null,null,null,null,null,null,null,null,null,null,null,null,null,null,null,null,null,null,null,null,"Date ou période de soutenance"]
[null,null,null,null,null,null,null,null,null,null,null,null,null,null,null,null,null,null,null,null,null,null,null,null,null,null,null,null,null,null,null,null,null,null,null,null,null,null,null,null,"Date de début et de fin du cycle de formation"]
[null,null,null,null,null,null,null,null,null,null,null,null,null,null,null,null,null,null,null,null,null,null,null,null,null,null,null,null,null,null,null,null,null,null,null,null,null,null,null,null,"Periodes en entreprise"]
[null,null,null,null,null,null,null,null,null,null,null,null,null,null,null,null,null,null,null,null,null,null,null,null,null,null,null,null,null,null,null,null,null,null,null,null,null,null,null,null,"Périodes à l'université"]
[null,null,2024,null,null,null,{"$f":"IF(MONTH(1&G6)=1,An+1,\"\")","v":""},null,null,null,null,null,null,null,null,null,null,null,null,null,null,null,null,null,null,null,null,null,null,null,null,null,null,null,null,null,null,null,null,null,"Vacances universitaires",null,null,null,null,null,null,null,null,null,2025]
[null,null,"septembre",null,null,null,{"$f":"CHOOSE(IF(MONTH(1&C6)=12,1,MONTH(1&C6)+1),\"Janvier\",\"Février\",\"Mars\",\"Avril\",\"Mai\",\"Juin\",\"Juillet\",\"Août\",\"Septembre\",\"Octobre\",\"Novembre\",\"Décembre\")","v":"Octobre"},null,null,null,{"$f":"CHOOSE(IF(MONTH(1&G6)=12,1,MONTH(1&G6)+1),\"Janvier\",\"Février\",\"Mars\",\"Avril\",\"Mai\",\"Juin\",\"Juillet\",\"Août\",\"Septembre\",\"Octobre\",\"Novembre\",\"Décembre\")","v":"Novembre"},null,null,null,{"$f":"CHOOSE(IF(MONTH(1&K6)=12,1,MONTH(1&K6)+1),\"Janvier\",\"Février\",\"Mars\",\"Avril\",\"Mai\",\"Juin\",\"Juillet\",\"Août\",\"Septembre\",\"Octobre\",\"Novembre\",\"Décembre\")","v":"Décembre"},null,null,null,{"$f":"CHOOSE(IF(MONTH(1&O6)=12,1,MONTH(1&O6)+1),\"Janvier\",\"Février\",\"Mars\",\"Avril\",\"Mai\",\"Juin\",\"Juillet\",\"Août\",\"Septembre\",\"Octobre\",\"Novembre\",\"Décembre\")","v":"Janvier"},null,null,null,{"$f":"CHOOSE(IF(MONTH(1&S6)=12,1,MONTH(1&S6)+1),\"Janvier\",\"Février\",\"Mars\",\"Avril\",\"Mai\",\"Juin\",\"Juillet\",\"Août\",\"Septembre\",\"Octobre\",\"Novembre\",\"Décembre\")","v":"Février"},null,null,null,{"$f":"CHOOSE(IF(MONTH(1&W6)=12,1,MONTH(1&W6)+1),\"Janvier\",\"Février\",\"Mars\",\"Avril\",\"Mai\",\"Juin\",\"Juillet\",\"Août\",\"Septembre\",\"Octobre\",\"Novembre\",\"Décembre\")","v":"Mars"},null,null,null,{"$f":"CHOOSE(IF(MONTH(1&AA6)=12,1,MONTH(1&AA6)+1),\"Janvier\",\"Février\",\"Mars\",\"Avril\",\"Mai\",\"Juin\",\"Juillet\",\"Août\",\"Septembre\",\"Octobre\",\"Novembre\",\"Décembre\")","v":"Avril"},null,null,null,{"$f":"CHOOSE(IF(MONTH(1&AE6)=12,1,MONTH(1&AE6)+1),\"Janvier\",\"Février\",\"Mars\",\"Avril\",\"Mai\",\"Juin\",\"Juillet\",\"Août\",\"Septembre\",\"Octobre\",\"Novembre\",\"Décembre\")","v":"Mai"},null,null,null,{"$f":"CHOOSE(IF(MONTH(1&AI6)=12,1,MONTH(1&AI6)+1),\"Janvier\",\"Février\",\"Mars\",\"Avril\",\"Mai\",\"Juin\",\"Juillet\",\"Août\",\"Septembre\",\"Octobre\",\"Novembre\",\"Décembre\")","v":"Juin"},null,null,null,{"$f":"CHOOSE(IF(MONTH(1&AM6)=12,1,MONTH(1&AM6)+1),\"Janvier\",\"Février\",\"Mars\",\"Avril\",\"Mai\",\"Juin\",\"Juillet\",\"Août\",\"Septembre\",\"Octobre\",\"Novembre\",\"Décembre\")","v":"Juillet"},null,null,null,{"$f":"CHOOSE(IF(MONTH(1&AQ6)=12,1,MONTH(1&AQ6)+1),\"Janvier\",\"Février\",\"Mars\",\"Avril\",\"Mai\",\"Juin\",\"Juillet\",\"Août\",\"Septembre\",\"Octobre\",\"Novembre\",\"Décembre\")","v":"Août"},null,null,null,{"$f":"CHOOSE(IF(MONTH(1&AU6)=12,1,MONTH(1&AU6)+1),\"Janvier\",\"Février\",\"Mars\",\"Avril\",\"Mai\",\"Juin\",\"Juillet\",\"Août\",\"Septembre\",\"Octobre\",\"Novembre\",\"Décembre\")","v":"Septembre"}]
[null,null,{"$f":"couleur","v":15},{"$f":"DATE(An,MONTH(1&C$6),1)","v":"2024-09-01"},{"$f":"IF(WEEKDAY(D7,2)=3, _xlfn.ISOWEEKNUM(D7),\"\")","v":""},null,{"$f":"couleur","v":6},{"$f":"DATE(IF(MONTH(1&G$6)=1,An+1,An),MONTH(1&G$6),1)","v":"2024-10-01"},{"$f":"IF(WEEKDAY(H7,2)=3, _xlfn.ISOWEEKNUM(H7),\"\")","v":""},null,{"$f":"couleur","v":44},{"$f":"DATE(IF(MONTH(1&G$6)<MONTH(1&K$6),YEAR(H7),An+1),MONTH(1&K$6),1)","v":"2024-11-01"},null,null,{"$f":"couleur","v":2},{"$f":"DATE(IF(MONTH(1&K$6)<MONTH(1&O$6),YEAR(L7),An+1),MONTH(1&O$6),1)","v":"2024-12-01"},{"$f":"IF(WEEKDAY(P7,2)=3, _xlfn.ISOWEEKNUM(P7),\"\")","v":""},null,{"$f":"couleur","v":44},{"$f":"DATE(IF(MONTH(1&O$6)<MONTH(1&S$6),YEAR(P7),An+1),MONTH(1&S$6),1)","v":"2025-01-01"},{"$f":"IF(WEEKDAY(T7,2)=3, _xlfn.ISOWEEKNUM(T7),\"\")","v":1},null,{"$f":"couleur","v":2},{"$f":"DATE(IF(MONTH(1&S$6)<MONTH(1&W$6),YEAR(T7),An+1),MONTH(1&W$6),1)","v":"2025-02-01"},{"$f":"IF(WEEKDAY(X7,2)=3, _xlfn.ISOWEEKNUM(X7),\"\")","v":""},null,{"$f":"couleur","v":6},{"$f":"DATE(IF(MONTH(1&W$6)<MONTH(1&AA$6),YEAR(X7),An+1),MONTH(1&AA$6),1)","v":"2025-03-01"},{"$f":"IF(WEEKDAY(AB7,2)=3, _xlfn.ISOWEEKNUM(AB7),\"\")","v":""},null,{"$f":"couleur","v":6},{"$f":"DATE(IF(MONTH(1&AA$6)<MONTH(1&AE$6),YEAR(AB7),An+1),MONTH(1&AE$6),1)","v":"2025-04-01"},{"$f":"IF(WEEKDAY(AF7,2)=3, _xlfn.ISOWEEKNUM(AF7),\"\")","v":""},null,{"$f":"couleur","v":44},{"$f":"DATE(IF(MONTH(1&AE$6)<MONTH(1&AI$6),YEAR(AF7),An+1),MONTH(1&AI$6),1)","v":"2025-05-01"},{"$f":"IF(WEEKDAY(AJ7,2)=3, _xlfn.ISOWEEKNUM(AJ7),\"\")","v":""},null,{"$f":"couleur","v":6},{"$f":"DATE(IF(MONTH(1&AI$6)<MONTH(1&AM$6),YEAR(AJ7),An+1),MONTH(1&AM$6),1)","v":"2025-06-01"},{"$f":"IF(WEEKDAY(AN7,2)=3, _xlfn.ISOWEEKNUM(AN7),\"\")","v":""},null,{"$f":"couleur","v":6},{"$f":"DATE(IF(MONTH(1&AM$6)<MONTH(1&AQ$6),YEAR(AN7),An+1),MONTH(1&AQ$6),1)","v":"2025-07-01"},{"$f":"IF(WEEKDAY(AR7,2)=3, _xlfn.ISOWEEKNUM(AR7),\"\")","v":""},null,{"$f":"couleur","v":6},{"$f":"DATE(IF(MONTH(1&AQ$6)<MONTH(1&AU$6),YEAR(AR7),An+1),MONTH(1&AU$6),1)","v":"2025-08-01"},{"$f":"IF(WEEKDAY(AV7,2)=3, _xlfn.ISOWEEKNUM(AV7),\"\")","v":""},null,{"$f":"couleur","v":15},{"$f":"DATE(IF(MONTH(1&AU$6)<MONTH(1&AY$6),YEAR(AV7),YEAR(AV7)+1),MONTH(1&AY$6),1)","v":"2025-09-01"},{"$f":"IF(WEEKDAY(AZ7,2)=3, _xlfn.ISOWEEKNUM(AZ7),\"\")","v":""}]
[null,null,{"$f":"couleur","v":6},{"$f":"D7+1","v":"2024-09-02"},{"$f":"IF(WEEKDAY(D8,2)=3, _xlfn.ISOWEEKNUM(D8),\"\")","v":""},null,{"$f":"couleur","v":33},{"$f":"H7+1","v":"2024-10-02"},{"$f":"IF(WEEKDAY(H8,2)=3, _xlfn.ISOWEEKNUM(H8),\"\")","v":40},7,{"$f":"couleur","v":6},{"$f":"L7+1","v":"2024-11-02"},{"$f":"IF(WEEKDAY(L8,2)=3, _xlfn.ISOWEEKNUM(L8),\"\")","v":""},null,{"$f":"couleur","v":6},{"$f":"P7+1","v":"2024-12-02"},{"$f":"IF(WEEKDAY(P8,2)=3, _xlfn.ISOWEEKNUM(P8),\"\")","v":""},null,{"$f":"couleur","v":6},{"$f":"T7+1","v":"2025-01-02"},{"$f":"IF(WEEKDAY(T8,2)=3, _xlfn.ISOWEEKNUM(T8),\"\")","v":""},null,{"$f":"couleur","v":2},{"$f":"X7+1","v":"2025-02-02"},{"$f":"IF(WEEKDAY(X8,2)=3, _xlfn.ISOWEEKNUM(X8),\"\")","v":""},null,{"$f":"couleur","v":33},{"$f":"AB7+1","v":"2025-03-02"},{"$f":"IF(WEEKDAY(AB8,2)=3, _xlfn.ISOWEEKNUM(AB8),\"\")","v":""},null,{"$f":"couleur","v":33},{"$f":"AF7+1","v":"2025-04-02"},{"$f":"IF(WEEKDAY(AF8,2)=3, _xlfn.ISOWEEKNUM(AF8),\"\")","v":14},7,{"$f":"couleur","v":6},{"$f":"AJ7+1","v":"2025-05-02"},{"$f":"IF(WEEKDAY(AJ8,2)=3, _xlfn.ISOWEEKNUM(AJ8),\"\")","v":""},null,{"$f":"couleur","v":6},{"$f":"AN7+1","v":"2025-06-02"},{"$f":"IF(WEEKDAY(AN8,2)=3, _xlfn.ISOWEEKNUM(AN8),\"\")","v":""},null,{"$f":"couleur","v":6},{"$f":"AR7+1","v":"2025-07-02"},{"$f":"IF(WEEKDAY(AR8,2)=3, _xlfn.ISOWEEKNUM(AR8),\"\")","v":27},null,{"$f":"couleur","v":2},{"$f":"AV7+1","v":"2025-08-02"},{"$f":"IF(WEEKDAY(AV8,2)=3, _xlfn.ISOWEEKNUM(AV8),\"\")","v":""},null,{"$f":"couleur","v":15},{"$f":"AZ7+1","v":"2025-09-02"},{"$f":"IF(WEEKDAY(AZ8,2)=3, _xlfn.ISOWEEKNUM(AZ8),\"\")","v":""}]
[null,null,{"$f":"couleur","v":6},{"$f":"D8+1","v":"2024-09-03"},"",null,{"$f":"couleur","v":33},{"$f":"H8+1","v":"2024-10-03"},"",7,{"$f":"couleur","v":6},{"$f":"L8+1","v":"2024-11-03"},"",null,{"$f":"couleur","v":6},{"$f":"P8+1","v":"2024-12-03"},"",null,{"$f":"couleur","v":6},{"$f":"T8+1","v":"2025-01-03"},"",null,{"$f":"couleur","v":6},{"$f":"X8+1","v":"2025-02-03"},"",null,{"$f":"couleur","v":6},{"$f":"AB8+1","v":"2025-03-03"},"",null,{"$f":"couleur","v":33},{"$f":"AF8+1","v":"2025-04-03"},"",7,{"$f":"couleur","v":2},{"$f":"AJ8+1","v":"2025-05-03"},"",null,{"$f":"couleur","v":6},{"$f":"AN8+1","v":"2025-06-03"},"",null,{"$f":"couleur","v":6},{"$f":"AR8+1","v":"2025-07-03"},"",null,{"$f":"couleur","v":2},{"$f":"AV8+1","v":"2025-08-03"},"",null,{"$f":"couleur","v":15},{"$f":"AZ8+1","v":"2025-09-03"},36]
[null,null,{"$f":"couleur","v":6},"2024-09-04",36,null,{"$f":"couleur","v":6},"2024-10-04","",null,{"$f":"couleur","v":6},"2024-11-04","",null,{"$f":"couleur","v":33},"2024-12-04",49,7,{"$f":"couleur","v":6},"2025-01-04","",null,{"$f":"couleur","v":6},"2025-02-04","",null,{"$f":"couleur","v":6},"2025-03-04","",null,{"$f":"couleur","v":33},"2025-04-04","",7,{"$f":"couleur","v":2},"2025-05-04","",null,{"$f":"couleur","v":6},"2025-06-04",23,null,{"$f":"couleur","v":6},"2025-07-04","",null,{"$f":"couleur","v":6},"2025-08-04","",null,{"$f":"couleur","v":15},"2025-09-04",""]
[null,null,{"$f":"couleur","v":6},"2024-09-05",{"$f":"IF(WEEKDAY(D11,2)=3, _xlfn.ISOWEEKNUM(D11),\"\")","v":""},null,{"$f":"couleur","v":2},"2024-10-05","",null,{"$f":"couleur","v":6},"2024-11-05","",null,{"$f":"couleur","v":33},"2024-12-05","",7,{"$f":"couleur","v":6},"2025-01-05","",null,{"$f":"couleur","v":33},"2025-02-05",6,7,{"$f":"couleur","v":33},"2025-03-05",10,7,{"$f":"couleur","v":2},"2025-04-05","",null,{"$f":"couleur","v":6},"2025-05-05","",null,{"$f":"couleur","v":6},"2025-06-05","",null,{"$f":"couleur","v":2},"2025-07-05","",null,{"$f":"couleur","v":6},"2025-08-05","",null,{"$f":"couleur","v":15},"2025-09-05",""]
[null,null,{"$f":"couleur","v":33},{"$f":"D11+1","v":"2024-09-06"},"",7,{"$f":"couleur","v":2},"2024-10-06","",null,{"$f":"couleur","v":33},"2024-11-06",45,7,{"$f":"couleur","v":33},"2024-12-06","",7,{"$f":"couleur","v":6},"2025-01-06","",null,{"$f":"couleur","v":33},"2025-02-06","",7,{"$f":"couleur","v":33},"2025-03-06","",7,{"$f":"couleur","v":2},"2025-04-06","",null,{"$f":"couleur","v":6},"2025-05-06","",null,{"$f":"couleur","v":33},"2025-06-06","",7,{"$f":"couleur","v":2},"2025-07-06","",null,{"$f":"couleur","v":6},"2025-08-06",32,null,{"$f":"couleur","v":2},"2025-09-06","",null,null,"Nb d'heures total de formation",463,"et 9 jours d'examens"]
[null,null,{"$f":"couleur","v":15},"2024-09-07","",null,{"$f":"couleur","v":6},"2024-10-07","",null,{"$f":"couleur","v":33},"2024-11-07","",7,{"$f":"couleur","v":2},"2024-12-07","",null,{"$f":"couleur","v":6},"2025-01-07","",null,{"$f":"couleur","v":33},"2025-02-07","",7,{"$f":"couleur","v":33},"2025-03-07","",7,{"$f":"couleur","v":6},"2025-04-07","",null,{"$f":"couleur","v":6},"2025-05-07",19,null,{"$f":"couleur","v":2},"2025-06-07","",null,{"$f":"couleur","v":6},"2025-07-07","",null,{"$f":"couleur","v":6},"2025-08-07","",null,{"$f":"couleur","v":2},"2025-09-07","",null,null,"Nb de jours en entreprise"]
[null,null,{"$f":"couleur","v":15},"2024-09-08","",null,{"$f":"couleur","v":6},"2024-10-08","",null,{"$f":"couleur","v":33},"2024-11-08","",7,{"$f":"couleur","v":2},"2024-12-08","",null,{"$f":"couleur","v":6},"2025-01-08",2,null,{"$f":"couleur","v":2},"2025-02-08","",null,{"$f":"couleur","v":2},"2025-03-08","",null,{"$f":"couleur","v":6},"2025-04-08","",null,{"$f":"couleur","v":44},"2025-05-08","",null,{"$f":"couleur","v":2},"2025-06-08","",null,{"$f":"couleur","v":6},"2025-07-08","",null,{"$f":"couleur","v":6},"2025-08-08","",null,{"$f":"couleur","v":15},"2025-09-08","",null,null,"Nb de jours à l'université"]
[null,null,{"$f":"couleur","v":6},"2024-09-09","",null,{"$f":"couleur","v":33},"2024-10-09",41,7,{"$f":"couleur","v":2},"2024-11-09","",null,{"$f":"couleur","v":6},"2024-12-09","",null,{"$f":"couleur","v":6},"2025-01-09","",null,{"$f":"couleur","v":2},"2025-02-09","",null,{"$f":"couleur","v":2},"2025-03-09","",null,{"$f":"couleur","v":6},"2025-04-09",15,null,{"$f":"couleur","v":6},"2025-05-09","",null,{"$f":"couleur","v":44},"2025-06-09","",null,{"$f":"couleur","v":6},"2025-07-09",28,null,{"$f":"couleur","v":2},"2025-08-09","",null,{"$f":"couleur","v":15},"2025-09-09","",null,null,"Nb d'heures moyen de formation par jour à l'université","7h"]
[null,null,{"$f":"couleur","v":6},"2024-09-10","",null,{"$f":"couleur","v":33},"2024-10-10","",7,{"$f":"couleur","v":2},"2024-11-10","",null,{"$f":"couleur","v":6},"2024-12-10","",null,{"$f":"couleur","v":6},"2025-01-10","",null,{"$f":"couleur","v":6},"2025-02-10","",null,{"$f":"couleur","v":6},"2025-03-10","",null,{"$f":"couleur","v":6},"2025-04-10","",null,{"$f":"couleur","v":2},"2025-05-10","",null,{"$f":"couleur","v":6},"2025-06-10","",null,{"$f":"couleur","v":6},"2025-07-10","",null,{"$f":"couleur","v":2},"2025-08-10","",null,{"$f":"couleur","v":15},"2025-09-10",37]
[null,null,{"$f":"couleur","v":33},"2024-09-11",37,7,{"$f":"couleur","v":6},"2024-10-11","",null,{"$f":"couleur","v":44},"2024-11-11","",null,{"$f":"couleur","v":33},"2024-12-11",50,7,{"$f":"couleur","v":2},"2025-01-11","",null,{"$f":"couleur","v":6},"2025-02-11","",null,{"$f":"couleur","v":6},"2025-03-11","",null,{"$f":"couleur","v":6},"2025-04-11","",null,{"$f":"couleur","v":2},"2025-05-11","",null,{"$f":"couleur","v":6},"2025-06-11",24,null,{"$f":"couleur","v":6},"2025-07-11","",null,{"$f":"couleur","v":6},"2025-08-11","",null,{"$f":"couleur","v":15},"2025-09-11",""]
[null,null,{"$f":"couleur","v":33},{"$f":"D17+1","v":"2024-09-12"},{"$f":"IF(WEEKDAY(D18,2)=3, _xlfn.ISOWEEKNUM(D18),\"\")","v":""},7,{"$f":"couleur","v":2},"2024-10-12","",null,{"$f":"couleur","v":6},"2024-11-12","",null,{"$f":"couleur","v":33},"2024-12-12","",7,{"$f":"couleur","v":2},"2025-01-12","",null,{"$f":"couleur","v":33},"2025-02-12",7,7,{"$f":"couleur","v":33},"2025-03-12",11,7,{"$f":"couleur","v":2},"2025-04-12","",null,{"$f":"couleur","v":6},"2025-05-12","",null,{"$f":"couleur","v":6},"2025-06-12","",null,{"$f":"couleur","v":2},"2025-07-12","",null,{"$f":"couleur","v":6},"2025-08-12","",null,{"$f":"couleur","v":15},"2025-09-12",""]
[null,null,{"$f":"couleur","v":6},{"$f":"D18+1","v":"2024-09-13"},"",null,{"$f":"couleur","v":2},"2024-10-13","",null,{"$f":"couleur","v":6},"2024-11-13",46,null,{"$f":"couleur","v":33},"2024-12-13","",7,{"$f":"couleur","v":33},"2025-01-13","","examens",{"$f":"couleur","v":33},"2025-02-13","",7,{"$f":"couleur","v":33},"2025-03-13","",7,{"$f":"couleur","v":2},"2025-04-13","",null,{"$f":"couleur","v":6},"2025-05-13","",null,{"$f":"couleur","v":6},"2025-06-13","",null,{"$f":"couleur","v":2},"2025-07-13","",null,{"$f":"couleur","v":6},"2025-08-13",33,null,{"$f":"couleur","v":15},"2025-09-13",""]
[null,null,{"$f":"couleur","v":2},"2024-09-14","",null,{"$f":"couleur","v":6},"2024-10-14","",null,{"$f":"couleur","v":6},"2024-11-14","",null,{"$f":"couleur","v":2},"2024-12-14","",null,{"$f":"couleur","v":33},"2025-01-14","","examens",{"$f":"couleur","v":33},"2025-02-14","",7,{"$f":"couleur","v":33},"2025-03-14","",7,{"$f":"couleur","v":6},"2025-04-14","",null,{"$f":"couleur","v":6},"2025-05-14",20,null,{"$f":"couleur","v":2},"2025-06-14","",null,{"$f":"couleur","v":44},"2025-07-14","",null,{"$f":"couleur","v":6},"2025-08-14","",null,{"$f":"couleur","v":15},"2025-09-14",""]
[null,null,{"$f":"couleur","v":2},"2024-09-15","",null,{"$f":"couleur","v":6},"2024-10-15","",null,{"$f":"couleur","v":6},"2024-11-15","",null,{"$f":"couleur","v":2},"2024-12-15","",null,{"$f":"couleur","v":33},"2025-01-15",3,"examens",{"$f":"couleur","v":2},"2025-02-15","",null,{"$f":"couleur","v":2},"2025-03-15","",null,{"$f":"couleur","v":6},"2025-04-15","",null,{"$f":"couleur","v":6},"2025-05-15","",null,{"$f":"couleur","v":2},"2025-06-15","",null,{"$f":"couleur","v":6},"2025-07-15","",null,{"$f":"couleur","v":6},"2025-08-15","",null,{"$f":"couleur","v":15},"2025-09-15",""]
[null,null,{"$f":"couleur","v":6},"2024-09-16","",null,{"$f":"couleur","v":33},"2024-10-16",42,7,{"$f":"couleur","v":33},"2024-11-16","",null,{"$f":"couleur","v":6},"2024-12-16","",null,{"$f":"couleur","v":33},"2025-01-16","","examens",{"$f":"couleur","v":2},"2025-02-16","",null,{"$f":"couleur","v":2},"2025-03-16","",null,{"$f":"couleur","v":6},"2025-04-16",16,null,{"$f":"couleur","v":6},"2025-05-16","",null,{"$f":"couleur","v":6},"2025-06-16","",null,{"$f":"couleur","v":6},"2025-07-16",29,null,{"$f":"couleur","v":2},"2025-08-16","",null,{"$f":"couleur","v":15},"2025-09-16","",null,null,{"$f":"35*7","v":245},"s1",null,226]
[null,null,{"$f":"couleur","v":6},"2024-09-17","",null,{"$f":"couleur","v":33},"2024-10-17","",7,{"$f":"couleur","v":33},"2024-11-17","",null,{"$f":"couleur","v":6},"2024-12-17","",null,{"$f":"couleur","v":33},"2025-01-17","","examens",{"$f":"couleur","v":6},"2025-02-17","",null,{"$f":"couleur","v":6},"2025-03-17","",null,{"$f":"couleur","v":6},"2025-04-17",{"$f":"IF(WEEKDAY(AF23,2)=3, _xlfn.ISOWEEKNUM(AF23),\"\")","v":""},null,{"$f":"couleur","v":2},"2025-05-17","",null,{"$f":"couleur","v":6},"2025-06-17","",null,{"$f":"couleur","v":6},"2025-07-17","",null,{"$f":"couleur","v":2},"2025-08-17","",null,{"$f":"couleur","v":15},"2025-09-17",38,null,null,{"$f":"30*7","v":210},"s2",null,251]
[null,null,{"$f":"couleur","v":33},"2024-09-18",38,7,{"$f":"couleur","v":6},"2024-10-18","",null,{"$f":"couleur","v":6},"2024-11-18","",null,{"$f":"couleur","v":33},"2024-12-18",51,7,{"$f":"couleur","v":2},"2025-01-18","",null,{"$f":"couleur","v":6},"2025-02-18","",null,{"$f":"couleur","v":6},"2025-03-18","",null,{"$f":"couleur","v":6},"2025-04-18","",null,{"$f":"couleur","v":2},"2025-05-18","",null,{"$f":"couleur","v":6},"2025-06-18",25,null,{"$f":"couleur","v":6},"2025-07-18","",null,{"$f":"couleur","v":6},"2025-08-18","",null,{"$f":"couleur","v":15},"2025-09-18","",null,null,448,null,null,468]
[null,null,{"$f":"couleur","v":33},"2024-09-19","",7,{"$f":"couleur","v":2},"2024-10-19","",null,{"$f":"couleur","v":6},"2024-11-19","",null,{"$f":"couleur","v":33},"2024-12-19",{"$f":"IF(WEEKDAY(P25,2)=3, _xlfn.ISOWEEKNUM(P25),\"\")","v":""},7,{"$f":"couleur","v":2},"2025-01-19","",null,{"$f":"couleur","v":33},"2025-02-19",8,7,{"$f":"couleur","v":33},"2025-03-19",12,7,{"$f":"couleur","v":2},"2025-04-19","",null,{"$f":"couleur","v":6},"2025-05-19","",null,{"$f":"couleur","v":6},"2025-06-19","",null,{"$f":"couleur","v":2},"2025-07-19","",null,{"$f":"couleur","v":6},"2025-08-19","",null,{"$f":"couleur","v":15},"2025-09-19",""]
[null,null,{"$f":"couleur","v":6},"2024-09-20","",null,{"$f":"couleur","v":2},"2024-10-20","",null,{"$f":"couleur","v":33},"2024-11-20",47,7,{"$f":"couleur","v":33},"2024-12-20","",7,{"$f":"couleur","v":6},"2025-01-20","",null,{"$f":"couleur","v":33},"2025-02-20",{"$f":"IF(WEEKDAY(X26,2)=3, _xlfn.ISOWEEKNUM(X26),\"\")","v":""},7,{"$f":"couleur","v":33},"2025-03-20","",7,{"$f":"couleur","v":2},"2025-04-20","",null,{"$f":"couleur","v":6},"2025-05-20","",null,{"$f":"couleur","v":6},"2025-06-20","",null,{"$f":"couleur","v":2},"2025-07-20","",null,{"$f":"couleur","v":6},"2025-08-20",34,null,{"$f":"couleur","v":15},"2025-09-20",""]
[null,null,{"$f":"couleur","v":2},"2024-09-21","",null,{"$f":"couleur","v":6},"2024-10-21","",null,{"$f":"couleur","v":33},"2024-11-21","",7,{"$f":"couleur","v":2},{"$f":"P26+1","v":"2024-12-21"},"",null,{"$f":"couleur","v":6},"2025-01-21","",null,{"$f":"couleur","v":33},"2025-02-21","",7,{"$f":"couleur","v":33},"2025-03-21","",7,{"$f":"couleur","v":44},"2025-04-21","",null,{"$f":"couleur","v":6},"2025-05-21",21,null,{"$f":"couleur","v":2},"2025-06-21","",null,{"$f":"couleur","v":6},"2025-07-21","",null,{"$f":"couleur","v":6},"2025-08-21","",null,{"$f":"couleur","v":15},"2025-09-21",""]
[null,null,{"$f":"couleur","v":2},"2024-09-22","",null,{"$f":"couleur","v":6},"2024-10-22","",null,{"$f":"couleur","v":33},"2024-11-22","",7,{"$f":"couleur","v":2},"2024-12-22","",null,{"$f":"couleur","v":33},"2025-01-22",4,7,{"$f":"couleur","v":2},"2025-02-22","",null,{"$f":"couleur","v":2},"2025-03-22","",null,{"$f":"couleur","v":6},"2025-04-22","",null,{"$f":"couleur","v":6},"2025-05-22","",null,{"$f":"couleur","v":2},"2025-06-22","",null,{"$f":"couleur","v":6},"2025-07-22","",null,{"$f":"couleur","v":6},"2025-08-22","",null,{"$f":"couleur","v":15},"2025-09-22",""]
[null,null,{"$f":"couleur","v":6},"2024-09-23","",null,{"$f":"couleur","v":33},"2024-10-23",43,7,{"$f":"couleur","v":2},"2024-11-23","",null,{"$f":"couleur","v":6},"2024-12-23","",null,{"$f":"couleur","v":33},"2025-01-23","",7,{"$f":"couleur","v":2},"2025-02-23","",null,{"$f":"couleur","v":2},"2025-03-23","",null,{"$f":"couleur","v":6},"2025-04-23",17,null,{"$f":"couleur","v":6},"2025-05-23","",null,{"$f":"couleur","v":6},"2025-06-23","",null,{"$f":"couleur","v":6},"2025-07-23",30,null,{"$f":"couleur","v":2},"2025-08-23","",null,{"$f":"couleur","v":15},"2025-09-23",""]
[null,null,{"$f":"couleur","v":6},"2024-09-24","",null,{"$f":"couleur","v":33},"2024-10-24",{"$f":"IF(WEEKDAY(H30,2)=3, _xlfn.ISOWEEKNUM(H30),\"\")","v":""},7,{"$f":"couleur","v":2},"2024-11-24","",null,{"$f":"couleur","v":6},"2024-12-24","",null,{"$f":"couleur","v":6},"2025-01-24","",null,{"$f":"couleur","v":6},"2025-02-24","",null,{"$f":"couleur","v":6},"2025-03-24","",null,{"$f":"couleur","v":6},"2025-04-24","",null,{"$f":"couleur","v":2},"2025-05-24","",null,{"$f":"couleur","v":6},"2025-06-24","",null,{"$f":"couleur","v":6},"2025-07-24",{"$f":"IF(WEEKDAY(AR30,2)=3, _xlfn.ISOWEEKNUM(AR30),\"\")","v":""},null,{"$f":"couleur","v":2},"2025-08-24","",null,{"$f":"couleur","v":15},"2025-09-24",39]
[null,null,{"$f":"couleur","v":33},"2024-09-25",39,7,{"$f":"couleur","v":33},"2024-10-25","",7,{"$f":"couleur","v":6},"2024-11-25","",null,{"$f":"couleur","v":44},"2024-12-25",52,null,{"$f":"couleur","v":2},"2025-01-25","",null,{"$f":"couleur","v":6},"2025-02-25","",null,{"$f":"couleur","v":6},"2025-03-25","",null,{"$f":"couleur","v":6},"2025-04-25","",null,{"$f":"couleur","v":2},"2025-05-25","",null,{"$f":"couleur","v":6},"2025-06-25",26,null,{"$f":"couleur","v":6},"2025-07-25","",null,{"$f":"couleur","v":6},"2025-08-25","",null,{"$f":"couleur","v":15},"2025-09-25",""]
[null,null,{"$f":"couleur","v":33},"2024-09-26","",7,{"$f":"couleur","v":2},"2024-10-26","",null,{"$f":"couleur","v":6},"2024-11-26","",null,{"$f":"couleur","v":6},"2024-12-26",{"$f":"IF(WEEKDAY(P32,2)=3, _xlfn.ISOWEEKNUM(P32),\"\")","v":""},null,{"$f":"couleur","v":2},"2025-01-26","",null,{"$f":"couleur","v":6},"2025-02-26",9,null,{"$f":"couleur","v":33},"2025-03-26",13,7,{"$f":"couleur","v":6},"2025-04-26","",null,{"$f":"couleur","v":33},"2025-05-26","","examens",{"$f":"couleur","v":6},"2025-06-26","",null,{"$f":"couleur","v":2},"2025-07-26","",null,{"$f":"couleur","v":6},"2025-08-26","",null,{"$f":"couleur","v":15},"2025-09-26",""]
[null,null,{"$f":"couleur","v":6},"2024-09-27","",null,{"$f":"couleur","v":2},"2024-10-27","",null,{"$f":"couleur","v":33},"2024-11-27",48,7,{"$f":"couleur","v":6},"2024-12-27","",null,{"$f":"couleur","v":6},"2025-01-27","",null,{"$f":"couleur","v":6},"2025-02-27","",null,{"$f":"couleur","v":33},"2025-03-27","",7,{"$f":"couleur","v":6},"2025-04-27","",null,{"$f":"couleur","v":33},"2025-05-27","","examens",{"$f":"couleur","v":6},"2025-06-27","",null,{"$f":"couleur","v":2},"2025-07-27","",null,{"$f":"couleur","v":6},"2025-08-27",35,null,{"$f":"couleur","v":15},"2025-09-27",""]
[null,null,{"$f":"couleur","v":2},"2024-09-28","",null,{"$f":"couleur","v":6},"2024-10-28","",null,{"$f":"couleur","v":33},"2024-11-28","",7,{"$f":"couleur","v":6},"2024-12-28","",null,{"$f":"couleur","v":6},"2025-01-28","",null,{"$f":"couleur","v":6},"2025-02-28","",null,{"$f":"couleur","v":33},"2025-03-28","",7,{"$f":"couleur","v":6},"2025-04-28","",null,{"$f":"couleur","v":33},"2025-05-28",22,"examens",{"$f":"couleur","v":2},"2025-06-28","",null,{"$f":"couleur","v":6},"2025-07-28","",null,{"$f":"couleur","v":6},"2025-08-28","",null,{"$f":"couleur","v":15},"2025-09-28",""]
[null,null,{"$f":"couleur","v":2},{"$f":"IFERROR(IF(OR(D34=\"\",MONTH(D34+1)>MONTH(D34)),\"\",D34+1),\"\")","v":"2024-09-29"},{"$f":"IFERROR(IF(WEEKDAY(D35,2)=3, _xlfn.ISOWEEKNUM(D35),\"\"),\"\")","v":""},null,{"$f":"couleur","v":6},{"$f":"IFERROR(IF(OR(H34=\"\",MONTH(H34+1)>MONTH(H34)),\"\",H34+1),\"\")","v":"2024-10-29"},{"$f":"IFERROR(IF(WEEKDAY(H35,2)=3, _xlfn.ISOWEEKNUM(H35),\"\"),\"\")","v":""},null,{"$f":"couleur","v":33},{"$f":"IFERROR(IF(OR(L34=\"\",MONTH(L34+1)>MONTH(L34)),\"\",L34+1),\"\")","v":"2024-11-29"},{"$f":"IFERROR(IF(WEEKDAY(L35,2)=3, _xlfn.ISOWEEKNUM(L35),\"\"),\"\")","v":""},7,{"$f":"couleur","v":6},{"$f":"IFERROR(IF(OR(P34=\"\",MONTH(P34+1)>MONTH(P34)),\"\",P34+1),\"\")","v":"2024-12-29"},{"$f":"IFERROR(IF(WEEKDAY(P35,2)=3, _xlfn.ISOWEEKNUM(P35),\"\"),\"\")","v":""},null,{"$f":"couleur","v":33},{"$f":"IFERROR(IF(OR(T34=\"\",MONTH(T34+1)>MONTH(T34)),\"\",T34+1),\"\")","v":"2025-01-29"},{"$f":"IFERROR(IF(WEEKDAY(T35,2)=3, _xlfn.ISOWEEKNUM(T35),\"\"),\"\")","v":5},7,{"$f":"couleur","v":6},{"$f":"IFERROR(IF(OR(X34=\"\",MONTH(X34+1)>MONTH(X34)),\"\",X34+1),\"\")","v":""},{"$f":"IFERROR(IF(WEEKDAY(X35,2)=3, _xlfn.ISOWEEKNUM(X35),\"\"),\"\")","v":""},{"$f":"IFERROR(IF(OR(Z34=\"\",MONTH(Z34+1)>MONTH(Z34)),\"\",Z34+1),\"\")","v":""},{"$f":"couleur","v":2},{"$f":"IFERROR(IF(OR(AB34=\"\",MONTH(AB34+1)>MONTH(AB34)),\"\",AB34+1),\"\")","v":"2025-03-29"},{"$f":"IFERROR(IF(WEEKDAY(AB35,2)=3, _xlfn.ISOWEEKNUM(AB35),\"\"),\"\")","v":""},null,{"$f":"couleur","v":6},{"$f":"IFERROR(IF(OR(AF34=\"\",MONTH(AF34+1)>MONTH(AF34)),\"\",AF34+1),\"\")","v":"2025-04-29"},{"$f":"IFERROR(IF(WEEKDAY(AF35,2)=3, _xlfn.ISOWEEKNUM(AF35),\"\"),\"\")","v":""},null,{"$f":"couleur","v":44},{"$f":"IFERROR(IF(OR(AJ34=\"\",MONTH(AJ34+1)>MONTH(AJ34)),\"\",AJ34+1),\"\")","v":"2025-05-29"},{"$f":"IFERROR(IF(WEEKDAY(AJ35,2)=3, _xlfn.ISOWEEKNUM(AJ35),\"\"),\"\")","v":""},null,{"$f":"couleur","v":33},{"$f":"IFERROR(IF(OR(AN34=\"\",MONTH(AN34+1)>MONTH(AN34)),\"\",AN34+1),\"\")","v":"2025-06-29"},{"$f":"IFERROR(IF(WEEKDAY(AN35,2)=3, _xlfn.ISOWEEKNUM(AN35),\"\"),\"\")","v":""},null,{"$f":"couleur","v":6},{"$f":"IFERROR(IF(OR(AR34=\"\",MONTH(AR34+1)>MONTH(AR34)),\"\",AR34+1),\"\")","v":"2025-07-29"},{"$f":"IFERROR(IF(WEEKDAY(AR35,2)=3, _xlfn.ISOWEEKNUM(AR35),\"\"),\"\")","v":""},null,{"$f":"couleur","v":6},{"$f":"IFERROR(IF(OR(AV34=\"\",MONTH(AV34+1)>MONTH(AV34)),\"\",AV34+1),\"\")","v":"2025-08-29"},{"$f":"IFERROR(IF(WEEKDAY(AV35,2)=3, _xlfn.ISOWEEKNUM(AV35),\"\"),\"\")","v":""},null,{"$f":"couleur","v":15},{"$f":"IFERROR(IF(OR(AZ34=\"\",MONTH(AZ34+1)>MONTH(AZ34)),\"\",AZ34+1),\"\")","v":"2025-09-29"},{"$f":"IFERROR(IF(WEEKDAY(AZ35,2)=3, _xlfn.ISOWEEKNUM(AZ35),\"\"),\"\")","v":""}]
[null,null,{"$f":"couleur","v":6},{"$f":"IFERROR(IF(OR(D35=\"\",MONTH(D35+1)>MONTH(D35)),\"\",D35+1),\"\")","v":"2024-09-30"},{"$f":"IFERROR(IF(WEEKDAY(D36,2)=3, _xlfn.ISOWEEKNUM(D36),\"\"),\"\")","v":""},null,{"$f":"couleur","v":33},{"$f":"IFERROR(IF(OR(H35=\"\",MONTH(H35+1)>MONTH(H35)),\"\",H35+1),\"\")","v":"2024-10-30"},{"$f":"IFERROR(IF(WEEKDAY(H36,2)=3, _xlfn.ISOWEEKNUM(H36),\"\"),\"\")","v":44},7,{"$f":"couleur","v":2},{"$f":"IFERROR(IF(OR(L35=\"\",MONTH(L35+1)>MONTH(L35)),\"\",L35+1),\"\")","v":"2024-11-30"},{"$f":"IFERROR(IF(WEEKDAY(L36,2)=3, _xlfn.ISOWEEKNUM(L36),\"\"),\"\")","v":""},null,{"$f":"couleur","v":6},{"$f":"IFERROR(IF(OR(P35=\"\",MONTH(P35+1)>MONTH(P35)),\"\",P35+1),\"\")","v":"2024-12-30"},{"$f":"IFERROR(IF(WEEKDAY(P36,2)=3, _xlfn.ISOWEEKNUM(P36),\"\"),\"\")","v":""},null,{"$f":"couleur","v":33},{"$f":"IFERROR(IF(OR(T35=\"\",MONTH(T35+1)>MONTH(T35)),\"\",T35+1),\"\")","v":"2025-01-30"},{"$f":"IFERROR(IF(WEEKDAY(T36,2)=3, _xlfn.ISOWEEKNUM(T36),\"\"),\"\")","v":""},7,{"$f":"couleur","v":0},null,null,null,{"$f":"couleur","v":6},{"$f":"IFERROR(IF(OR(AB35=\"\",MONTH(AB35+1)>MONTH(AB35)),\"\",AB35+1),\"\")","v":"2025-03-30"},{"$f":"IFERROR(IF(WEEKDAY(AB36,2)=3, _xlfn.ISOWEEKNUM(AB36),\"\"),\"\")","v":""},null,{"$f":"couleur","v":6},{"$f":"IFERROR(IF(OR(AF35=\"\",MONTH(AF35+1)>MONTH(AF35)),\"\",AF35+1),\"\")","v":"2025-04-30"},{"$f":"IFERROR(IF(WEEKDAY(AF36,2)=3, _xlfn.ISOWEEKNUM(AF36),\"\"),\"\")","v":18},null,{"$f":"couleur","v":33},{"$f":"IFERROR(IF(OR(AJ35=\"\",MONTH(AJ35+1)>MONTH(AJ35)),\"\",AJ35+1),\"\")","v":"2025-05-30"},{"$f":"IFERROR(IF(WEEKDAY(AJ36,2)=3, _xlfn.ISOWEEKNUM(AJ36),\"\"),\"\")","v":""},"examens",{"$f":"couleur","v":6},{"$f":"IFERROR(IF(OR(AN35=\"\",MONTH(AN35+1)>MONTH(AN35)),\"\",AN35+1),\"\")","v":"2025-06-30"},{"$f":"IFERROR(IF(WEEKDAY(AN36,2)=3, _xlfn.ISOWEEKNUM(AN36),\"\"),\"\")","v":""},null,{"$f":"couleur","v":6},{"$f":"IFERROR(IF(OR(AR35=\"\",MONTH(AR35+1)>MONTH(AR35)),\"\",AR35+1),\"\")","v":"2025-07-30"},{"$f":"IFERROR(IF(WEEKDAY(AR36,2)=3, _xlfn.ISOWEEKNUM(AR36),\"\"),\"\")","v":31},null,{"$f":"couleur","v":2},{"$f":"IFERROR(IF(OR(AV35=\"\",MONTH(AV35+1)>MONTH(AV35)),\"\",AV35+1),\"\")","v":"2025-08-30"},{"$f":"IFERROR(IF(WEEKDAY(AV36,2)=3, _xlfn.ISOWEEKNUM(AV36),\"\"),\"\")","v":""},null,{"$f":"couleur","v":15},{"$f":"IFERROR(IF(OR(AZ35=\"\",MONTH(AZ35+1)>MONTH(AZ35)),\"\",AZ35+1),\"\")","v":"2025-09-30"},{"$f":"IFERROR(IF(WEEKDAY(AZ36,2)=3, _xlfn.ISOWEEKNUM(AZ36),\"\"),\"\")","v":""}]
[null,null,null,null,null,null,{"$f":"couleur","v":6},{"$f":"IFERROR(IF(OR(H36=\"\",MONTH(H36+1)>MONTH(H36)),\"\",H36+1),\"\")","v":"2024-10-31"},{"$f":"IFERROR(IF(WEEKDAY(H37,2)=3, _xlfn.ISOWEEKNUM(H37),\"\"),\"\")","v":""},null,{"$f":"couleur","v":15},{"$f":"IFERROR(IF(OR(L36=\"\",MONTH(L36+1)>MONTH(L36)),\"\",L36+1),\"\")","v":""},{"$f":"IFERROR(IF(WEEKDAY(L37,2)=3, _xlfn.ISOWEEKNUM(L37),\"\"),\"\")","v":""},null,{"$f":"couleur","v":6},{"$f":"IFERROR(IF(OR(P36=\"\",MONTH(P36+1)>MONTH(P36)),\"\",P36+1),\"\")","v":"2024-12-31"},{"$f":"IFERROR(IF(WEEKDAY(P37,2)=3, _xlfn.ISOWEEKNUM(P37),\"\"),\"\")","v":""},null,{"$f":"couleur","v":33},{"$f":"IFERROR(IF(OR(T36=\"\",MONTH(T36+1)>MONTH(T36)),\"\",T36+1),\"\")","v":"2025-01-31"},{"$f":"IFERROR(IF(WEEKDAY(T37,2)=3, _xlfn.ISOWEEKNUM(T37),\"\"),\"\")","v":""},7,{"$f":"couleur","v":0},null,null,null,{"$f":"couleur","v":6},{"$f":"IFERROR(IF(OR(AB36=\"\",MONTH(AB36+1)>MONTH(AB36)),\"\",AB36+1),\"\")","v":"2025-03-31"},{"$f":"IFERROR(IF(WEEKDAY(AB37,2)=3, _xlfn.ISOWEEKNUM(AB37),\"\"),\"\")","v":""},null,{"$f":"couleur","v":0},null,null,null,{"$f":"couleur","v":2},{"$f":"IFERROR(IF(OR(AJ36=\"\",MONTH(AJ36+1)>MONTH(AJ36)),\"\",AJ36+1),\"\")","v":"2025-05-31"},{"$f":"IFERROR(IF(WEEKDAY(AJ37,2)=3, _xlfn.ISOWEEKNUM(AJ37),\"\"),\"\")","v":""},null,{"$f":"couleur","v":0},null,null,null,{"$f":"couleur","v":6},{"$f":"IFERROR(IF(OR(AR36=\"\",MONTH(AR36+1)>MONTH(AR36)),\"\",AR36+1),\"\")","v":"2025-07-31"},{"$f":"IFERROR(IF(WEEKDAY(AR37,2)=3, _xlfn.ISOWEEKNUM(AR37),\"\"),\"\")","v":""},null,{"$f":"couleur","v":6},{"$f":"IFERROR(IF(OR(AV36=\"\",MONTH(AV36+1)>MONTH(AV36)),\"\",AV36+1),\"\")","v":"2025-08-31"},{"$f":"IFERROR(IF(WEEKDAY(AV37,2)=3, _xlfn.ISOWEEKNUM(AV37),\"\"),\"\")","v":""},null,{"$f":"couleur","v":0}]
[null,null,null,null,null,{"$f":"F35+F34+F33+F32+F31+F28+F26+F27+F25+F24+F21+F20+F19+F18+F17+F14+F13+F12+F11+F10+F7+F8+F9+F15+F16+F22+F23+F29+F30+F36","v":49},null,null,null,{"$f":"J37+J36+J33+J31+J32+J30+J29+J26+J25+J24+J23+J22+J19+J18+J17+J16+J15+J12+J11+J10+J9+J8+J35+J34+J27+J28+J21+J20+J14+J13+J7","v":70},null,null,null,{"$f":"SUM(N7:N36)","v":63},null,null,null,{"$f":"SUM(R7:R37)","v":63},null,null,null,{"$f":"SUM(V7:V37)","v":35},null,null,null,{"$f":"SUM(Z7:Z37)","v":63},null,null,null,{"$f":"SUM(AD7:AD37)","v":84},null,null,null,{"$f":"SUM(AH7:AH37)","v":21},null,null,null,{"$f":"SUM(AL7:AL37)","v":0},null,null,null,{"$f":"SUM(AP7:AP37)","v":7},null,null,null,{"$f":"SUM(AT7:AT37)","v":0},null,null,null,{"$f":"SUM(AX7:AX37)","v":0},null,null,null,{"$f":"SUM(BB7:BB36)","v":0},null,{"$f":"BB38+AX38+AT38+AP38+AL38+AH38+AD38+Z38+V38+R38+N38+J38+F38","v":455},"heures"]
[null,null,null,null,null,null,null,null,null,null,null,null,null,null,null,null,null,null,null,null,null,null,null,null,null,null,null,null,null,null,null,null,null,null,null,null,null,null,null,null,null,null,null,null,null,null,null,null,null,null,null,null,null,null,null,{"$f":"BD38/35","v":13},"semaines à 35h"]
[]
[]
[{"$f":"IF(P5=\"Equipe atelier\",A43,IF(P5=\"Equipe 1\",A44,IF(P5=\"Equipe 2\",A45,\"\")))","v":""}]
["Calendrier 2019 Atelier Montage-Assemblage concerne :\nBIGOT YANNICK\nBODY FREDERIC\nBRICARD JEAN-JACQUES\nCHARIF WILFRIED\nCLAIR MELANIE\nCUREAU CORINNE\nDELAGARDE MARIE-ASTRID\nLIVACHE SABRINA\nMARCHAL ROBERT\nMORIN WILLY\nROUQUET SEVERINE\nSOURDEAU PATRICK\nSOYER DOMINIQUE\nTHOMAS JOHAN\nVINCELOT LAURENT\nCADU NATHALIE\nCOUTURIER LAURENT\nFRESNEAU ALAIN\nROCHAIS PHILIPPE\nARRIAL ANGELIQUE\nBELLANGER FRANCK\nBOUVET PASCAL\nHARDOUIN XAVIER\nLECAM EDDY\nMATIGNON DAVID\nMOYNNERAUX CHRISTOPHE\nPORCHER CHRISTOPHE\nSOURDEAU SEBASTIEN"]
["Calendrier 2019 Blanchisserie Equipe 1 concerne :\nAUBIN JACKY\nBARILLER RICHARD\nBEAUMONT PHILIPPE\nBERRUE ARNAUD\nBOUCHENOIRE PHILIPPE\nCHAPEAU PATRICK\nEQUIPE TIPHAINE\nGRIVAULT CHRISTELLE\nIACINO JODIE\nMARCEAU ANNE-SOPHIE\nOSSELIN BENEDICTE\nPETIT EMELINE\nPINIER VIRGINIE\nTAUVRY BRIGITTE\nTOUSSAINT SAMUEL"]
["Calendrier 2019 Blanchisserie Equipe 2 concerne :\nBERTIN LOIC\nBOUFFANDEAU SOPHIE\nCOUE LYSIANE\nDOURNAC NADINE\nDUREAU SONIA\nFRESNEAU BERNARD\nFRESNEAU PASCAL\nGENNETAY LAURENT\nLI CHIANG YAO MARINE\nLUCASSON ELENA\nSALAUN PATRICIA\nTIREL MICKAËL\nVIAL MATHIEU"]

{"sheet":"Légende","index":3,"n_rows":9,"n_cols":4,"rows_kept":9,"cut":false,"hidden":false,"merged":[]}
[]
[]
[]
[]
[]
[null,null,null,"Date ou période de soutenance"]
[null,null,null,"Date de début et de fin du cycle de formation"]
[null,null,null,"Periodes en entreprise"]
[null,null,null,"Périodes à l'université"]

{"sheet":"BD_CAL","index":4,"n_rows":40,"n_cols":7,"rows_kept":40,"cut":false,"hidden":false,"merged":[[0,6,0,9]]}
[null,"Importation ICal le : 13/10/2020",null,null,null,null,"Rendez vous sur le site via le lien data.gouv. \nTélécharger le fichier de la zone qui vous concerne et lancer la macro"]
[null,null,null,null,null,null,"https://www.data.gouv.fr/fr/datasets/le-calendrier-scolaire-format-ical/"]
["Vacances de la Toussaint\r","2017-10-21","2017-11-05"]
["Vacances de Noël\r","2017-12-23","2018-01-07"]
["Vacances d'Hiver\r","2018-02-10","2018-02-25"]
["Vacances de Printemps\r","2018-04-07","2018-04-22"]
["Vacances d'Ã‰té\r","2018-07-07","2018-08-30"]
["Vacances d'Ã‰té\r","2018-07-07","2018-09-02"]
["Vacances de la Toussaint\r","2018-10-20","2018-11-04"]
["Vacances de Noël\r","2018-12-22","2019-01-06"]
["Vacances d'Hiver\r","2019-02-16","2019-03-03"]
["Vacances de Printemps\r","2019-04-13","2019-04-28"]
["Pont de l'Ascension\r","2019-07-06","2019-06-02"]
["Vacances d'Ã‰té\r","2019-07-06","2019-08-29"]
["Vacances d'Ã‰té\r","2019-10-19","2019-09-01"]
["Vacances de la Toussaint\r","2019-12-21","2019-11-03"]
["Vacances de Noël\r","2020-02-22","2020-01-05"]
["Vacances d'Hiver\r","2020-04-18","2020-03-08"]
["Vacances de Printemps\r","2020-05-20","2020-05-03"]
["Pont de l'Ascension\r","2020-07-04","2020-05-24"]
["Vacances d'Ã‰té\r","2020-10-17","2020-08-31"]
["Vacances de la Toussaint\r","2020-12-19","2020-11-01"]
["Vacances de Noël\r","2021-02-06","2021-01-03"]
["Vacances d'Hiver\r","2021-04-10","2021-02-21"]
["Vacances de Printemps\r","2021-05-13","2021-04-25"]
["Pont de l'Ascension\r","2021-07-06","2021-05-16"]
["Vacances d'Ã‰té\r","2021-07-06","2021-08-31"]
["Vacances d'Ã‰té\r","2021-10-23","2021-09-01"]
["Vacances de la Toussaint\r","2021-12-18","2021-11-07"]
["Vacances de Noël\r","2022-02-12","2022-01-02"]
["Vacances d'Hiver\r","2022-04-16","2022-02-27"]
["Vacances de Printemps\r","2022-05-26","2022-05-01"]
["Pont de l'Ascension\r","2022-07-07","2022-05-27"]
["Vacances d'Ã‰té\r","2022-07-07","2022-08-30"]
["Vacances d'Ã‰té\r","2022-10-22","2022-08-31"]
["Vacances de la Toussaint\r","2022-12-17","2022-11-06"]
["Vacances de Noël\r","2023-02-04","2023-01-02"]
["Vacances d'Hiver\r","2023-04-08","2023-02-19"]
["Vacances de Printemps\r","2023-05-18","2023-04-23"]
["Pont de l'Ascension\r","2023-07-08","2023-05-22"]